Quantcast

postgresql8 +server problem

classic Classic list List threaded Threaded
1 message Options
Reply | Threaded
Open this post in threaded view
|  
Report Content as Inappropriate

postgresql8 +server problem

Gary MacDougall



Trying to do a:

sudo port install postgresql8 +server

Get the following error (note: no previous installation of PG is on  
my machine via port, so this is NOT an upgrade.)

execute.c: In function 'ECPGstore_input':
execute.c:549: warning: implicit declaration of function  
'ECPGis_noind_null'
execute.c: At top level:
execute.c:1364: error: conflicting types for 'ECPGdo'
/opt/local/include/ecpglib.h:50: error: previous declaration of  
'ECPGdo' was here



Complete log below...

Error: Target com.apple.build returned: shell command "cd "/opt/local/
var/db/dports/build/
_opt_local_var_db_dports_sources_rsync.rsync.darwinports.org_dpupdate_dp
orts_databases_postgresql8/work/postgresql-8.1.2" && gnumake"  
returned error 2
Command output: gnumake[3]: Nothing to be done for `all'.
gnumake[3]: Nothing to be done for `all'.
gnumake[3]: Nothing to be done for `all'.
gnumake[3]: Nothing to be done for `all'.
gnumake[3]: Nothing to be done for `all'.
gnumake[3]: Nothing to be done for `all'.
gnumake[3]: Nothing to be done for `all'.
gnumake[3]: Nothing to be done for `all'.
gnumake[3]: Nothing to be done for `all'.
gnumake[3]: Nothing to be done for `all'.
gnumake -C include all
gnumake[2]: Nothing to be done for `all'.
gnumake -C interfaces all
gnumake[3]: Nothing to be done for `all'.
gnumake -C include all
gnumake[4]: Nothing to be done for `all'.
gnumake -C pgtypeslib all
gnumake[4]: Nothing to be done for `all'.
gnumake -C ecpglib all
/usr/bin/gcc-4.0 -no-cpp-precomp -I/opt/local/var/db/dports/build/
_opt_local_var_db_dports_sources_rsync.rsync.darwinports.org_dpupdate_dp
orts_databases_postgresql8/work/postgresql-8.1.2/src/interfaces/libpq  
-I/opt/local/include -Wall -Wmissing-prototypes -Wpointer-arith -
Winline -Wdeclaration-after-statement -Wendif-labels -fno-strict-
aliasing -D_REENTRANT -D_THREAD_SAFE -D_POSIX_PTHREAD_SEMANTICS  -
DFRONTEND -I../../../../src/interfaces/ecpg/include -I../../../../src/
interfaces/libpq -I../../../../src/port -I../../../../src/include -I/
opt/local/include  -I/opt/local/include  -c -o execute.o execute.c
execute.c: In function 'ECPGstore_input':
execute.c:549: warning: implicit declaration of function  
'ECPGis_noind_null'
execute.c: At top level:
execute.c:1364: error: conflicting types for 'ECPGdo'
/opt/local/include/ecpglib.h:50: error: previous declaration of  
'ECPGdo' was here
gnumake[4]: *** [execute.o] Error 1
gnumake[3]: *** [all] Error 2
gnumake[2]: *** [all] Error 2
gnumake[1]: *** [all] Error 2
gnumake: *** [all] Error 2

Error: /opt/local/bin/port: Status 1 encountered during processing.

_______________________________________________
Darwinports mailing list
[hidden email]
http://www.opendarwin.org/mailman/listinfo/darwinports
Loading...