Results for 4.1.1 20060517 (prerelease) testsuite on i386-apple-darwin7.2.1

classic Classic list List threaded Threaded
1 message Options
Reply | Threaded
Open this post in threaded view
|

Results for 4.1.1 20060517 (prerelease) testsuite on i386-apple-darwin7.2.1

Lars Sonchocky-Helldorf
This has been build with odcctools-20060413


LAST_UPDATED: Obtained from SVN: branches/gcc-4_1-branch revision 113871

Native configuration is i386-apple-darwin7.2.1

                === g++ tests ===


Running target unix
FAIL: g++.dg/abi/bitfield3.C execution test
FAIL: g++.dg/lookup/builtin1.C (test for excess errors)
FAIL: g++.dg/other/ucnid-1.C (test for excess errors)
WARNING: g++.dg/other/ucnid-1.C compilation failed to produce executable
FAIL: g++.dg/parse/pragma3.C execution test
XPASS: g++.dg/tree-ssa/pr14814.C scan-tree-dump-times &this 0
FAIL: g++.dg/warn/huge-val1.C (test for excess errors)
FAIL: g++.dg/warn/weak1.C (test for excess errors)
WARNING: g++.dg/warn/weak1.C compilation failed to produce executable
FAIL: g++.dg/special/conpr-3.C execution test
FAIL: g++.old-deja/g++.eh/badalloc1.C (test for excess errors)
XPASS: g++.old-deja/g++.eh/badalloc1.C execution test
FAIL: g++.old-deja/g++.mike/unused.C (test for excess errors)
FAIL: g++.old-deja/g++.other/store-expr1.C (test for excess errors)
WARNING: g++.old-deja/g++.other/store-expr1.C compilation failed to  
produce executable

                === g++ Summary ===

# of expected passes 11994
# of unexpected failures 10
# of unexpected successes 2
# of expected failures 67
# of unsupported tests 99
/Volumes/Data/Users/lars/GCC/FSF/gcc-4.1.1-20060517-build/gcc/
testsuite/g++/../../g++  version 4.1.1 20060517 (prerelease)

                === gcc tests ===


Running target unix
FAIL: gcc.c-torture/compile/20000804-1.c  -O0  (test for excess errors)
FAIL: gcc.c-torture/compile/20011029-1.c  -O0  (test for excess errors)
FAIL: gcc.c-torture/compile/20030921-1.c  -O0  (test for excess errors)
FAIL: gcc.c-torture/compile/20040909-1.c  -O0  (test for excess errors)
FAIL: gcc.c-torture/compile/981006-1.c  -O0  (test for excess errors)
FAIL: gcc.c-torture/compile/981006-1.c  -O1  (test for excess errors)
FAIL: gcc.c-torture/compile/981006-1.c  -O2  (test for excess errors)
FAIL: gcc.c-torture/compile/981006-1.c  -O3 -fomit-frame-pointer  
(test for excess errors)
FAIL: gcc.c-torture/compile/981006-1.c  -O3 -g  (test for excess errors)
FAIL: gcc.c-torture/compile/981006-1.c  -Os  (test for excess errors)
FAIL: gcc.c-torture/execute/builtins/memcpy-chk.c compilation,  -O0
UNRESOLVED: gcc.c-torture/execute/builtins/memcpy-chk.c execution,  -O0
FAIL: gcc.c-torture/execute/builtins/memcpy-chk.c compilation,  -O1
UNRESOLVED: gcc.c-torture/execute/builtins/memcpy-chk.c execution,  -O1
FAIL: gcc.c-torture/execute/builtins/memcpy-chk.c compilation,  -O2
UNRESOLVED: gcc.c-torture/execute/builtins/memcpy-chk.c execution,  -O2
FAIL: gcc.c-torture/execute/builtins/memcpy-chk.c compilation,  -O3 -
fomit-frame-pointer
UNRESOLVED: gcc.c-torture/execute/builtins/memcpy-chk.c execution,  -
O3 -fomit-frame-pointer
FAIL: gcc.c-torture/execute/builtins/memcpy-chk.c compilation,  -O3 -
fomit-frame-pointer -funroll-loops
UNRESOLVED: gcc.c-torture/execute/builtins/memcpy-chk.c execution,  -
O3 -fomit-frame-pointer -funroll-loops
FAIL: gcc.c-torture/execute/builtins/memcpy-chk.c compilation,  -O3 -
fomit-frame-pointer -funroll-all-loops -finline-functions
UNRESOLVED: gcc.c-torture/execute/builtins/memcpy-chk.c execution,  -
O3 -fomit-frame-pointer -funroll-all-loops -finline-functions
FAIL: gcc.c-torture/execute/builtins/memcpy-chk.c compilation,  -O3 -g
UNRESOLVED: gcc.c-torture/execute/builtins/memcpy-chk.c execution,  -
O3 -g
FAIL: gcc.c-torture/execute/builtins/memcpy-chk.c compilation,  -Os
UNRESOLVED: gcc.c-torture/execute/builtins/memcpy-chk.c execution,  -Os
FAIL: gcc.c-torture/execute/builtins/memmove-chk.c compilation,  -O0
UNRESOLVED: gcc.c-torture/execute/builtins/memmove-chk.c execution,  -O0
FAIL: gcc.c-torture/execute/builtins/memmove-chk.c compilation,  -O1
UNRESOLVED: gcc.c-torture/execute/builtins/memmove-chk.c execution,  -O1
FAIL: gcc.c-torture/execute/builtins/memmove-chk.c compilation,  -O2
UNRESOLVED: gcc.c-torture/execute/builtins/memmove-chk.c execution,  -O2
FAIL: gcc.c-torture/execute/builtins/memmove-chk.c compilation,  -O3 -
fomit-frame-pointer
UNRESOLVED: gcc.c-torture/execute/builtins/memmove-chk.c execution,  -
O3 -fomit-frame-pointer
FAIL: gcc.c-torture/execute/builtins/memmove-chk.c compilation,  -O3 -
fomit-frame-pointer -funroll-loops
UNRESOLVED: gcc.c-torture/execute/builtins/memmove-chk.c execution,  -
O3 -fomit-frame-pointer -funroll-loops
FAIL: gcc.c-torture/execute/builtins/memmove-chk.c compilation,  -O3 -
fomit-frame-pointer -funroll-all-loops -finline-functions
UNRESOLVED: gcc.c-torture/execute/builtins/memmove-chk.c execution,  -
O3 -fomit-frame-pointer -funroll-all-loops -finline-functions
FAIL: gcc.c-torture/execute/builtins/memmove-chk.c compilation,  -O3 -g
UNRESOLVED: gcc.c-torture/execute/builtins/memmove-chk.c execution,  -
O3 -g
FAIL: gcc.c-torture/execute/builtins/memmove-chk.c compilation,  -Os
UNRESOLVED: gcc.c-torture/execute/builtins/memmove-chk.c execution,  -Os
FAIL: gcc.c-torture/execute/builtins/mempcpy-chk.c compilation,  -O0
UNRESOLVED: gcc.c-torture/execute/builtins/mempcpy-chk.c execution,  -O0
FAIL: gcc.c-torture/execute/builtins/mempcpy-chk.c compilation,  -O1
UNRESOLVED: gcc.c-torture/execute/builtins/mempcpy-chk.c execution,  -O1
FAIL: gcc.c-torture/execute/builtins/mempcpy-chk.c compilation,  -O2
UNRESOLVED: gcc.c-torture/execute/builtins/mempcpy-chk.c execution,  -O2
FAIL: gcc.c-torture/execute/builtins/mempcpy-chk.c compilation,  -O3 -
fomit-frame-pointer
UNRESOLVED: gcc.c-torture/execute/builtins/mempcpy-chk.c execution,  -
O3 -fomit-frame-pointer
FAIL: gcc.c-torture/execute/builtins/mempcpy-chk.c compilation,  -O3 -
fomit-frame-pointer -funroll-loops
UNRESOLVED: gcc.c-torture/execute/builtins/mempcpy-chk.c execution,  -
O3 -fomit-frame-pointer -funroll-loops
FAIL: gcc.c-torture/execute/builtins/mempcpy-chk.c compilation,  -O3 -
fomit-frame-pointer -funroll-all-loops -finline-functions
UNRESOLVED: gcc.c-torture/execute/builtins/mempcpy-chk.c execution,  -
O3 -fomit-frame-pointer -funroll-all-loops -finline-functions
FAIL: gcc.c-torture/execute/builtins/mempcpy-chk.c compilation,  -O3 -g
UNRESOLVED: gcc.c-torture/execute/builtins/mempcpy-chk.c execution,  -
O3 -g
FAIL: gcc.c-torture/execute/builtins/mempcpy-chk.c compilation,  -Os
UNRESOLVED: gcc.c-torture/execute/builtins/mempcpy-chk.c execution,  -Os
FAIL: gcc.c-torture/execute/builtins/memset-chk.c compilation,  -O0
UNRESOLVED: gcc.c-torture/execute/builtins/memset-chk.c execution,  -O0
FAIL: gcc.c-torture/execute/builtins/memset-chk.c compilation,  -O1
UNRESOLVED: gcc.c-torture/execute/builtins/memset-chk.c execution,  -O1
FAIL: gcc.c-torture/execute/builtins/memset-chk.c compilation,  -O2
UNRESOLVED: gcc.c-torture/execute/builtins/memset-chk.c execution,  -O2
FAIL: gcc.c-torture/execute/builtins/memset-chk.c compilation,  -O3 -
fomit-frame-pointer
UNRESOLVED: gcc.c-torture/execute/builtins/memset-chk.c execution,  -
O3 -fomit-frame-pointer
FAIL: gcc.c-torture/execute/builtins/memset-chk.c compilation,  -O3 -
fomit-frame-pointer -funroll-loops
UNRESOLVED: gcc.c-torture/execute/builtins/memset-chk.c execution,  -
O3 -fomit-frame-pointer -funroll-loops
FAIL: gcc.c-torture/execute/builtins/memset-chk.c compilation,  -O3 -
fomit-frame-pointer -funroll-all-loops -finline-functions
UNRESOLVED: gcc.c-torture/execute/builtins/memset-chk.c execution,  -
O3 -fomit-frame-pointer -funroll-all-loops -finline-functions
FAIL: gcc.c-torture/execute/builtins/memset-chk.c compilation,  -O3 -g
UNRESOLVED: gcc.c-torture/execute/builtins/memset-chk.c execution,  -
O3 -g
FAIL: gcc.c-torture/execute/builtins/memset-chk.c compilation,  -Os
UNRESOLVED: gcc.c-torture/execute/builtins/memset-chk.c execution,  -Os
FAIL: gcc.c-torture/execute/builtins/snprintf-chk.c compilation,  -O0
UNRESOLVED: gcc.c-torture/execute/builtins/snprintf-chk.c execution,  
-O0
FAIL: gcc.c-torture/execute/builtins/snprintf-chk.c compilation,  -O1
UNRESOLVED: gcc.c-torture/execute/builtins/snprintf-chk.c execution,  
-O1
FAIL: gcc.c-torture/execute/builtins/snprintf-chk.c compilation,  -O2
UNRESOLVED: gcc.c-torture/execute/builtins/snprintf-chk.c execution,  
-O2
FAIL: gcc.c-torture/execute/builtins/snprintf-chk.c compilation,  -O3  
-fomit-frame-pointer
UNRESOLVED: gcc.c-torture/execute/builtins/snprintf-chk.c execution,  
-O3 -fomit-frame-pointer
FAIL: gcc.c-torture/execute/builtins/snprintf-chk.c compilation,  -O3  
-fomit-frame-pointer -funroll-loops
UNRESOLVED: gcc.c-torture/execute/builtins/snprintf-chk.c execution,  
-O3 -fomit-frame-pointer -funroll-loops
FAIL: gcc.c-torture/execute/builtins/snprintf-chk.c compilation,  -O3  
-fomit-frame-pointer -funroll-all-loops -finline-functions
UNRESOLVED: gcc.c-torture/execute/builtins/snprintf-chk.c execution,  
-O3 -fomit-frame-pointer -funroll-all-loops -finline-functions
FAIL: gcc.c-torture/execute/builtins/snprintf-chk.c compilation,  -O3 -g
UNRESOLVED: gcc.c-torture/execute/builtins/snprintf-chk.c execution,  
-O3 -g
FAIL: gcc.c-torture/execute/builtins/snprintf-chk.c compilation,  -Os
UNRESOLVED: gcc.c-torture/execute/builtins/snprintf-chk.c execution,  
-Os
FAIL: gcc.c-torture/execute/builtins/sprintf-chk.c compilation,  -O0
UNRESOLVED: gcc.c-torture/execute/builtins/sprintf-chk.c execution,  -O0
FAIL: gcc.c-torture/execute/builtins/sprintf-chk.c compilation,  -O1
UNRESOLVED: gcc.c-torture/execute/builtins/sprintf-chk.c execution,  -O1
FAIL: gcc.c-torture/execute/builtins/sprintf-chk.c compilation,  -O2
UNRESOLVED: gcc.c-torture/execute/builtins/sprintf-chk.c execution,  -O2
FAIL: gcc.c-torture/execute/builtins/sprintf-chk.c compilation,  -O3 -
fomit-frame-pointer
UNRESOLVED: gcc.c-torture/execute/builtins/sprintf-chk.c execution,  -
O3 -fomit-frame-pointer
FAIL: gcc.c-torture/execute/builtins/sprintf-chk.c compilation,  -O3 -
fomit-frame-pointer -funroll-loops
UNRESOLVED: gcc.c-torture/execute/builtins/sprintf-chk.c execution,  -
O3 -fomit-frame-pointer -funroll-loops
FAIL: gcc.c-torture/execute/builtins/sprintf-chk.c compilation,  -O3 -
fomit-frame-pointer -funroll-all-loops -finline-functions
UNRESOLVED: gcc.c-torture/execute/builtins/sprintf-chk.c execution,  -
O3 -fomit-frame-pointer -funroll-all-loops -finline-functions
FAIL: gcc.c-torture/execute/builtins/sprintf-chk.c compilation,  -O3 -g
UNRESOLVED: gcc.c-torture/execute/builtins/sprintf-chk.c execution,  -
O3 -g
FAIL: gcc.c-torture/execute/builtins/sprintf-chk.c compilation,  -Os
UNRESOLVED: gcc.c-torture/execute/builtins/sprintf-chk.c execution,  -Os
FAIL: gcc.c-torture/execute/builtins/stpcpy-chk.c compilation,  -O0
UNRESOLVED: gcc.c-torture/execute/builtins/stpcpy-chk.c execution,  -O0
FAIL: gcc.c-torture/execute/builtins/stpcpy-chk.c compilation,  -O1
UNRESOLVED: gcc.c-torture/execute/builtins/stpcpy-chk.c execution,  -O1
FAIL: gcc.c-torture/execute/builtins/stpcpy-chk.c compilation,  -O2
UNRESOLVED: gcc.c-torture/execute/builtins/stpcpy-chk.c execution,  -O2
FAIL: gcc.c-torture/execute/builtins/stpcpy-chk.c compilation,  -O3 -
fomit-frame-pointer
UNRESOLVED: gcc.c-torture/execute/builtins/stpcpy-chk.c execution,  -
O3 -fomit-frame-pointer
FAIL: gcc.c-torture/execute/builtins/stpcpy-chk.c compilation,  -O3 -
fomit-frame-pointer -funroll-loops
UNRESOLVED: gcc.c-torture/execute/builtins/stpcpy-chk.c execution,  -
O3 -fomit-frame-pointer -funroll-loops
FAIL: gcc.c-torture/execute/builtins/stpcpy-chk.c compilation,  -O3 -
fomit-frame-pointer -funroll-all-loops -finline-functions
UNRESOLVED: gcc.c-torture/execute/builtins/stpcpy-chk.c execution,  -
O3 -fomit-frame-pointer -funroll-all-loops -finline-functions
FAIL: gcc.c-torture/execute/builtins/stpcpy-chk.c compilation,  -O3 -g
UNRESOLVED: gcc.c-torture/execute/builtins/stpcpy-chk.c execution,  -
O3 -g
FAIL: gcc.c-torture/execute/builtins/stpcpy-chk.c compilation,  -Os
UNRESOLVED: gcc.c-torture/execute/builtins/stpcpy-chk.c execution,  -Os
FAIL: gcc.c-torture/execute/builtins/strcat-chk.c compilation,  -O0
UNRESOLVED: gcc.c-torture/execute/builtins/strcat-chk.c execution,  -O0
FAIL: gcc.c-torture/execute/builtins/strcat-chk.c compilation,  -O1
UNRESOLVED: gcc.c-torture/execute/builtins/strcat-chk.c execution,  -O1
FAIL: gcc.c-torture/execute/builtins/strcat-chk.c compilation,  -O2
UNRESOLVED: gcc.c-torture/execute/builtins/strcat-chk.c execution,  -O2
FAIL: gcc.c-torture/execute/builtins/strcat-chk.c compilation,  -O3 -
fomit-frame-pointer
UNRESOLVED: gcc.c-torture/execute/builtins/strcat-chk.c execution,  -
O3 -fomit-frame-pointer
FAIL: gcc.c-torture/execute/builtins/strcat-chk.c compilation,  -O3 -
fomit-frame-pointer -funroll-loops
UNRESOLVED: gcc.c-torture/execute/builtins/strcat-chk.c execution,  -
O3 -fomit-frame-pointer -funroll-loops
FAIL: gcc.c-torture/execute/builtins/strcat-chk.c compilation,  -O3 -
fomit-frame-pointer -funroll-all-loops -finline-functions
UNRESOLVED: gcc.c-torture/execute/builtins/strcat-chk.c execution,  -
O3 -fomit-frame-pointer -funroll-all-loops -finline-functions
FAIL: gcc.c-torture/execute/builtins/strcat-chk.c compilation,  -O3 -g
UNRESOLVED: gcc.c-torture/execute/builtins/strcat-chk.c execution,  -
O3 -g
FAIL: gcc.c-torture/execute/builtins/strcat-chk.c compilation,  -Os
UNRESOLVED: gcc.c-torture/execute/builtins/strcat-chk.c execution,  -Os
FAIL: gcc.c-torture/execute/builtins/strcpy-chk.c compilation,  -O0
UNRESOLVED: gcc.c-torture/execute/builtins/strcpy-chk.c execution,  -O0
FAIL: gcc.c-torture/execute/builtins/strcpy-chk.c compilation,  -O1
UNRESOLVED: gcc.c-torture/execute/builtins/strcpy-chk.c execution,  -O1
FAIL: gcc.c-torture/execute/builtins/strcpy-chk.c compilation,  -O2
UNRESOLVED: gcc.c-torture/execute/builtins/strcpy-chk.c execution,  -O2
FAIL: gcc.c-torture/execute/builtins/strcpy-chk.c compilation,  -O3 -
fomit-frame-pointer
UNRESOLVED: gcc.c-torture/execute/builtins/strcpy-chk.c execution,  -
O3 -fomit-frame-pointer
FAIL: gcc.c-torture/execute/builtins/strcpy-chk.c compilation,  -O3 -
fomit-frame-pointer -funroll-loops
UNRESOLVED: gcc.c-torture/execute/builtins/strcpy-chk.c execution,  -
O3 -fomit-frame-pointer -funroll-loops
FAIL: gcc.c-torture/execute/builtins/strcpy-chk.c compilation,  -O3 -
fomit-frame-pointer -funroll-all-loops -finline-functions
UNRESOLVED: gcc.c-torture/execute/builtins/strcpy-chk.c execution,  -
O3 -fomit-frame-pointer -funroll-all-loops -finline-functions
FAIL: gcc.c-torture/execute/builtins/strcpy-chk.c compilation,  -O3 -g
UNRESOLVED: gcc.c-torture/execute/builtins/strcpy-chk.c execution,  -
O3 -g
FAIL: gcc.c-torture/execute/builtins/strcpy-chk.c compilation,  -Os
UNRESOLVED: gcc.c-torture/execute/builtins/strcpy-chk.c execution,  -Os
FAIL: gcc.c-torture/execute/builtins/strncat-chk.c compilation,  -O0
UNRESOLVED: gcc.c-torture/execute/builtins/strncat-chk.c execution,  -O0
FAIL: gcc.c-torture/execute/builtins/strncat-chk.c compilation,  -O1
UNRESOLVED: gcc.c-torture/execute/builtins/strncat-chk.c execution,  -O1
FAIL: gcc.c-torture/execute/builtins/strncat-chk.c compilation,  -O2
UNRESOLVED: gcc.c-torture/execute/builtins/strncat-chk.c execution,  -O2
FAIL: gcc.c-torture/execute/builtins/strncat-chk.c compilation,  -O3 -
fomit-frame-pointer
UNRESOLVED: gcc.c-torture/execute/builtins/strncat-chk.c execution,  -
O3 -fomit-frame-pointer
FAIL: gcc.c-torture/execute/builtins/strncat-chk.c compilation,  -O3 -
fomit-frame-pointer -funroll-loops
UNRESOLVED: gcc.c-torture/execute/builtins/strncat-chk.c execution,  -
O3 -fomit-frame-pointer -funroll-loops
FAIL: gcc.c-torture/execute/builtins/strncat-chk.c compilation,  -O3 -
fomit-frame-pointer -funroll-all-loops -finline-functions
UNRESOLVED: gcc.c-torture/execute/builtins/strncat-chk.c execution,  -
O3 -fomit-frame-pointer -funroll-all-loops -finline-functions
FAIL: gcc.c-torture/execute/builtins/strncat-chk.c compilation,  -O3 -g
UNRESOLVED: gcc.c-torture/execute/builtins/strncat-chk.c execution,  -
O3 -g
FAIL: gcc.c-torture/execute/builtins/strncat-chk.c compilation,  -Os
UNRESOLVED: gcc.c-torture/execute/builtins/strncat-chk.c execution,  -Os
FAIL: gcc.c-torture/execute/builtins/strncpy-chk.c compilation,  -O0
UNRESOLVED: gcc.c-torture/execute/builtins/strncpy-chk.c execution,  -O0
FAIL: gcc.c-torture/execute/builtins/strncpy-chk.c compilation,  -O1
UNRESOLVED: gcc.c-torture/execute/builtins/strncpy-chk.c execution,  -O1
FAIL: gcc.c-torture/execute/builtins/strncpy-chk.c compilation,  -O2
UNRESOLVED: gcc.c-torture/execute/builtins/strncpy-chk.c execution,  -O2
FAIL: gcc.c-torture/execute/builtins/strncpy-chk.c compilation,  -O3 -
fomit-frame-pointer
UNRESOLVED: gcc.c-torture/execute/builtins/strncpy-chk.c execution,  -
O3 -fomit-frame-pointer
FAIL: gcc.c-torture/execute/builtins/strncpy-chk.c compilation,  -O3 -
fomit-frame-pointer -funroll-loops
UNRESOLVED: gcc.c-torture/execute/builtins/strncpy-chk.c execution,  -
O3 -fomit-frame-pointer -funroll-loops
FAIL: gcc.c-torture/execute/builtins/strncpy-chk.c compilation,  -O3 -
fomit-frame-pointer -funroll-all-loops -finline-functions
UNRESOLVED: gcc.c-torture/execute/builtins/strncpy-chk.c execution,  -
O3 -fomit-frame-pointer -funroll-all-loops -finline-functions
FAIL: gcc.c-torture/execute/builtins/strncpy-chk.c compilation,  -O3 -g
UNRESOLVED: gcc.c-torture/execute/builtins/strncpy-chk.c execution,  -
O3 -g
FAIL: gcc.c-torture/execute/builtins/strncpy-chk.c compilation,  -Os
UNRESOLVED: gcc.c-torture/execute/builtins/strncpy-chk.c execution,  -Os
FAIL: gcc.c-torture/execute/builtins/vsnprintf-chk.c compilation,  -O0
UNRESOLVED: gcc.c-torture/execute/builtins/vsnprintf-chk.c  
execution,  -O0
FAIL: gcc.c-torture/execute/builtins/vsnprintf-chk.c compilation,  -O1
UNRESOLVED: gcc.c-torture/execute/builtins/vsnprintf-chk.c  
execution,  -O1
FAIL: gcc.c-torture/execute/builtins/vsnprintf-chk.c compilation,  -O2
UNRESOLVED: gcc.c-torture/execute/builtins/vsnprintf-chk.c  
execution,  -O2
FAIL: gcc.c-torture/execute/builtins/vsnprintf-chk.c compilation,  -
O3 -fomit-frame-pointer
UNRESOLVED: gcc.c-torture/execute/builtins/vsnprintf-chk.c  
execution,  -O3 -fomit-frame-pointer
FAIL: gcc.c-torture/execute/builtins/vsnprintf-chk.c compilation,  -
O3 -fomit-frame-pointer -funroll-loops
UNRESOLVED: gcc.c-torture/execute/builtins/vsnprintf-chk.c  
execution,  -O3 -fomit-frame-pointer -funroll-loops
FAIL: gcc.c-torture/execute/builtins/vsnprintf-chk.c compilation,  -
O3 -fomit-frame-pointer -funroll-all-loops -finline-functions
UNRESOLVED: gcc.c-torture/execute/builtins/vsnprintf-chk.c  
execution,  -O3 -fomit-frame-pointer -funroll-all-loops -finline-
functions
FAIL: gcc.c-torture/execute/builtins/vsnprintf-chk.c compilation,  -
O3 -g
UNRESOLVED: gcc.c-torture/execute/builtins/vsnprintf-chk.c  
execution,  -O3 -g
FAIL: gcc.c-torture/execute/builtins/vsnprintf-chk.c compilation,  -Os
UNRESOLVED: gcc.c-torture/execute/builtins/vsnprintf-chk.c  
execution,  -Os
FAIL: gcc.c-torture/execute/builtins/vsprintf-chk.c compilation,  -O0
UNRESOLVED: gcc.c-torture/execute/builtins/vsprintf-chk.c execution,  
-O0
FAIL: gcc.c-torture/execute/builtins/vsprintf-chk.c compilation,  -O1
UNRESOLVED: gcc.c-torture/execute/builtins/vsprintf-chk.c execution,  
-O1
FAIL: gcc.c-torture/execute/builtins/vsprintf-chk.c compilation,  -O2
UNRESOLVED: gcc.c-torture/execute/builtins/vsprintf-chk.c execution,  
-O2
FAIL: gcc.c-torture/execute/builtins/vsprintf-chk.c compilation,  -O3  
-fomit-frame-pointer
UNRESOLVED: gcc.c-torture/execute/builtins/vsprintf-chk.c execution,  
-O3 -fomit-frame-pointer
FAIL: gcc.c-torture/execute/builtins/vsprintf-chk.c compilation,  -O3  
-fomit-frame-pointer -funroll-loops
UNRESOLVED: gcc.c-torture/execute/builtins/vsprintf-chk.c execution,  
-O3 -fomit-frame-pointer -funroll-loops
FAIL: gcc.c-torture/execute/builtins/vsprintf-chk.c compilation,  -O3  
-fomit-frame-pointer -funroll-all-loops -finline-functions
UNRESOLVED: gcc.c-torture/execute/builtins/vsprintf-chk.c execution,  
-O3 -fomit-frame-pointer -funroll-all-loops -finline-functions
FAIL: gcc.c-torture/execute/builtins/vsprintf-chk.c compilation,  -O3 -g
UNRESOLVED: gcc.c-torture/execute/builtins/vsprintf-chk.c execution,  
-O3 -g
FAIL: gcc.c-torture/execute/builtins/vsprintf-chk.c compilation,  -Os
UNRESOLVED: gcc.c-torture/execute/builtins/vsprintf-chk.c execution,  
-Os
FAIL: gcc.c-torture/execute/built-in-setjmp.c compilation,  -O0
UNRESOLVED: gcc.c-torture/execute/built-in-setjmp.c execution,  -O0
FAIL: gcc.c-torture/execute/built-in-setjmp.c compilation,  -O1
UNRESOLVED: gcc.c-torture/execute/built-in-setjmp.c execution,  -O1
FAIL: gcc.c-torture/execute/built-in-setjmp.c compilation,  -O2
UNRESOLVED: gcc.c-torture/execute/built-in-setjmp.c execution,  -O2
FAIL: gcc.c-torture/execute/built-in-setjmp.c compilation,  -O3 -
fomit-frame-pointer
UNRESOLVED: gcc.c-torture/execute/built-in-setjmp.c execution,  -O3 -
fomit-frame-pointer
FAIL: gcc.c-torture/execute/built-in-setjmp.c compilation,  -O3 -
fomit-frame-pointer -funroll-loops
UNRESOLVED: gcc.c-torture/execute/built-in-setjmp.c execution,  -O3 -
fomit-frame-pointer -funroll-loops
FAIL: gcc.c-torture/execute/built-in-setjmp.c compilation,  -O3 -
fomit-frame-pointer -funroll-all-loops -finline-functions
UNRESOLVED: gcc.c-torture/execute/built-in-setjmp.c execution,  -O3 -
fomit-frame-pointer -funroll-all-loops -finline-functions
FAIL: gcc.c-torture/execute/built-in-setjmp.c compilation,  -O3 -g
UNRESOLVED: gcc.c-torture/execute/built-in-setjmp.c execution,  -O3 -g
FAIL: gcc.c-torture/execute/built-in-setjmp.c compilation,  -Os
UNRESOLVED: gcc.c-torture/execute/built-in-setjmp.c execution,  -Os
FAIL: gcc.c-torture/execute/conversion.c execution,  -O0
FAIL: gcc.c-torture/execute/conversion.c execution,  -O1
FAIL: gcc.c-torture/execute/conversion.c execution,  -O2
FAIL: gcc.c-torture/execute/stdarg-1.c execution,  -O3 -fomit-frame-
pointer
FAIL: gcc.c-torture/execute/ieee/fp-cmp-8l.c execution,  -O3 -fomit-
frame-pointer
FAIL: gcc.c-torture/execute/ieee/rbug.c execution,  -O0
FAIL: gcc.c-torture/execute/ieee/rbug.c execution,  -O1
FAIL: gcc.c-torture/execute/ieee/rbug.c execution,  -O2
FAIL: tmpdir-gcc.dg-struct-layout-1/t025 c_compat_x_tst.o-
c_compat_y_tst.o execute
FAIL: tmpdir-gcc.dg-struct-layout-1/t027 c_compat_x_tst.o-
c_compat_y_tst.o execute
FAIL: tmpdir-gcc.dg-struct-layout-1/t028 c_compat_x_tst.o-
c_compat_y_tst.o execute
FAIL: gcc.dg/cpp/ucs.c (test for excess errors)
FAIL: gcc.dg/20010912-1.c (test for excess errors)
WARNING: gcc.dg/20010912-1.c compilation failed to produce executable
FAIL: gcc.dg/20020103-1.c (test for excess errors)
ERROR: gcc.dg/20020103-1.c: error executing dg-final: couldn't open  
"20020103-1.s": no such file or directory
UNRESOLVED: gcc.dg/20020103-1.c: error executing dg-final: couldn't  
open "20020103-1.s": no such file or directory
FAIL: gcc.dg/20020430-1.c (test for excess errors)
FAIL: gcc.dg/20021029-1.c (test for excess errors)
ERROR: gcc.dg/20021029-1.c: error executing dg-final: couldn't open  
"20021029-1.s": no such file or directory
UNRESOLVED: gcc.dg/20021029-1.c: error executing dg-final: couldn't  
open "20021029-1.s": no such file or directory
FAIL: gcc.dg/20021116-1.c (test for excess errors)
FAIL: gcc.dg/20030702-1.c (test for excess errors)
FAIL: gcc.dg/20030708-1.c (test for excess errors)
FAIL: gcc.dg/20050321-2.c (test for excess errors)
FAIL: gcc.dg/attr-weakref-1.c (test for excess errors)
WARNING: gcc.dg/attr-weakref-1.c compilation failed to produce  
executable
FAIL: gcc.dg/c90-intconst-1.c (test for excess errors)
FAIL: gcc.dg/c90-intprom-1.c (test for excess errors)
FAIL: gcc.dg/const-compare.c (test for excess errors)
FAIL: gcc.dg/fold-cond-1.c scan-tree-dump-times \\(g \\| h\\) != 0 1
FAIL: gcc.dg/framework-1.c (test for excess errors)
FAIL: gcc.dg/i386-darwin-fpmath.c scan-assembler addsd
FAIL: gcc.dg/large-size-array.c (test for excess errors)
FAIL: gcc.dg/pragma-pack-3.c execution test
FAIL: gcc.dg/sibcall-6.c execution test
FAIL: gcc.dg/ucnid-4.c (test for excess errors)
WARNING: gcc.dg/ucnid-4.c compilation failed to produce executable
FAIL: gcc.dg/visibility-11.c scan-assembler memcpy@PLT
FAIL: gcc.dg/visibility-c.c (test for excess errors)
XPASS: gcc.dg/tree-ssa/20040204-1.c scan-tree-dump-times link_error 0
FAIL: gcc.dg/tree-ssa/loop-3.c scan-tree-dump-times step: 1
FAIL: gcc.target/i386/20011119-1.c (test for excess errors)
WARNING: gcc.target/i386/20011119-1.c compilation failed to produce  
executable
FAIL: gcc.target/i386/20020523-1.c (test for excess errors)
WARNING: gcc.target/i386/20020523-1.c compilation failed to produce  
executable
FAIL: gcc.target/i386/387-1.c scan-assembler call\\t_?sin
FAIL: gcc.target/i386/387-1.c scan-assembler call\\t_?cos
FAIL: gcc.target/i386/387-1.c scan-assembler call\\t_?sqrt
FAIL: gcc.target/i386/387-1.c scan-assembler call\\t_?atan2
FAIL: gcc.target/i386/387-1.c scan-assembler call\\t_?log
FAIL: gcc.target/i386/387-1.c scan-assembler call\\t_?exp
FAIL: gcc.target/i386/387-1.c scan-assembler call\\t_?tan
FAIL: gcc.target/i386/387-1.c scan-assembler call\\t_?fmod
FAIL: gcc.target/i386/387-3.c scan-assembler fldpi
FAIL: gcc.target/i386/387-4.c scan-assembler fldpi
FAIL: gcc.target/i386/387-5.c scan-assembler call\\t_?atan
FAIL: gcc.target/i386/387-5.c scan-assembler call\\t_?log1p
FAIL: gcc.target/i386/387-5.c scan-assembler call\\t_?drem
FAIL: gcc.target/i386/980211-1.c (test for excess errors)
FAIL: gcc.target/i386/asm-3.c (test for excess errors)
WARNING: gcc.target/i386/asm-3.c compilation failed to produce  
executable
FAIL: gcc.target/i386/bitfield1.c execution test
FAIL: gcc.target/i386/bitfield2.c execution test
FAIL: gcc.target/i386/clobbers.c (test for excess errors)
WARNING: gcc.target/i386/clobbers.c compilation failed to produce  
executable
FAIL: gcc.target/i386/pr21291.c (test for excess errors)
FAIL: gcc.target/i386/pr23098.c scan-assembler-not .LC[0-9]

                === gcc Summary ===

# of expected passes 37855
# of unexpected failures 178
# of unexpected successes 1
# of expected failures 99
# of unresolved testcases 114
# of untested testcases 28
# of unsupported tests 329
/Volumes/Data/Users/lars/GCC/FSF/gcc-4.1.1-20060517-build/gcc/xgcc  
version 4.1.1 20060517 (prerelease)

                === objc tests ===


Running target unix
FAIL: objc/execute/load-2.m execution,  -O0  -fnext-runtime
FAIL: objc/execute/load-2.m execution,  -O1  -fnext-runtime
FAIL: objc/execute/load-2.m execution,  -O2  -fnext-runtime
FAIL: objc/execute/load-2.m execution,  -O3 -fomit-frame-pointer  -
fnext-runtime
FAIL: objc/execute/load-2.m execution,  -O3 -g  -fnext-runtime
FAIL: objc/execute/load-2.m execution,  -Os  -fnext-runtime
FAIL: objc/execute/load.m execution,  -O0  -fnext-runtime
FAIL: objc/execute/load.m execution,  -O1  -fnext-runtime
FAIL: objc/execute/load.m execution,  -O2  -fnext-runtime
FAIL: objc/execute/load.m execution,  -O3 -fomit-frame-pointer  -
fnext-runtime
FAIL: objc/execute/load.m execution,  -O3 -g  -fnext-runtime
FAIL: objc/execute/load.m execution,  -Os  -fnext-runtime
FAIL: objc.dg/headers.m (test for excess errors)
FAIL: objc.dg/no-extra-load.m (test for excess errors)
ERROR: objc.dg/no-extra-load.m: error executing dg-final: couldn't  
open "no-extra-load.s": no such file or directory
UNRESOLVED: objc.dg/no-extra-load.m: error executing dg-final:  
couldn't open "no-extra-load.s": no such file or directory
FAIL: objc.dg/stret-2.m scan-assembler objc_msgSend_stret
FAIL: objc.dg/stret-2.m scan-assembler-not objc_msgSend[^_S]
FAIL: objc.dg/stret-2.m scan-assembler-not objc_msgSendSuper[^_]
FAIL: objc.dg/stubify-1.m (test for excess errors)
ERROR: objc.dg/stubify-1.m: error executing dg-final: couldn't open  
"stubify-1.s": no such file or directory
UNRESOLVED: objc.dg/stubify-1.m: error executing dg-final: couldn't  
open "stubify-1.s": no such file or directory
FAIL: objc.dg/stubify-2.m (test for excess errors)
ERROR: objc.dg/stubify-2.m: error executing dg-final: couldn't open  
"stubify-2.m.08.jump": no such file or directory
UNRESOLVED: objc.dg/stubify-2.m: error executing dg-final: couldn't  
open "stubify-2.m.08.jump": no such file or directory
FAIL: objc.dg/symtab-1.m scan-assembler L_OBJC_SYMBOLS.*:\\n\\t.long\
\t0\\n\\t.long\\t0\\n\\t.short\\t2\\n\\t.short\\t0\\n\\t.long\
\tL_OBJC_CLASS_Derived.*\\n\\t.long\\tL_OBJC_CLASS_Base.*\\n

                === objc Summary ===

# of expected passes 2876
# of unexpected failures 20
# of unresolved testcases 3
# of unsupported tests 2
/Volumes/Data/Users/lars/GCC/FSF/gcc-4.1.1-20060517-build/gcc/xgcc  
version 4.1.1 20060517 (prerelease)

                === libstdc++ tests ===


Running target unix
WARNING: program timed out.
FAIL: 21_strings/basic_string/cons/char/1.cc execution test
WARNING: program timed out.
FAIL: 21_strings/basic_string/cons/wchar_t/1.cc execution test
WARNING: program timed out.
FAIL: 21_strings/basic_string/insert/char/1.cc execution test
WARNING: program timed out.
FAIL: 21_strings/basic_string/insert/wchar_t/1.cc execution test
FAIL: 27_io/basic_filebuf/seekoff/char/26777.cc execution test
FAIL: 27_io/basic_ostream/inserters_arithmetic/wchar_t/4402.cc  
execution test
FAIL: 27_io/ios_base/storage/11584.cc execution test
FAIL: ext/mt_allocator/check_new.cc execution test
FAIL: ext/pool_allocator/check_new.cc execution test

                === libstdc++ Summary ===

# of expected passes 3388
# of unexpected failures 9
# of expected failures 11
# of unsupported tests 323

Compiler version: 4.1.1 20060517 (prerelease)
Platform: i386-apple-darwin7.2.1
configure flags: --prefix=/tmp/gcc --enable-languages=c,c++,java,objc


_______________________________________________
odcctools mailing list
[hidden email]
http://www.opendarwin.org/mailman/listinfo/odcctools