Re: #13042: bazaar don't build on Leopard

classic Classic list List threaded Threaded
3 messages Options
Reply | Threaded
Open this post in threaded view
|

Re: #13042: bazaar don't build on Leopard

Calendar and Contacts Server
#13042: bazaar don't build on Leopard
----------------------------------+-----------------------------------------
  Reporter:  [hidden email]  |       Owner:  [hidden email]
      Type:  defect               |      Status:  new                    
  Priority:  Normal               |   Milestone:  Port Bugs              
 Component:  ports                |     Version:  1.5.2                  
Resolution:                       |    Keywords:                          
----------------------------------+-----------------------------------------
Comment (by [hidden email]):

 Well here's the problem. What your log says:
 {{{
 DEBUG: Executing org.macports.build (bazaar)
 DEBUG: Environment:
 }}}
 What it should say (and what mine says):
 {{{
 DEBUG: Executing org.macports.build (bazaar)
 DEBUG: Environment: CFLAGS='-g -O2 -Wall -fno-strict-aliasing
 -I'/opt/local/include' -L'/opt/local/lib' -lintl -lneon -lgpgme -lpth'
 }}}

 So build.env isn't being set for some reason. I don't know why that would
 be, unless perhaps you're using a prerelease version of MacPorts (ticket
 says 1.5.2). Has splitting statements over multiple lines stopped working
 in 1.6?

--
Ticket URL: <http://trac.macosforge.org/projects/macports/ticket/13042#comment:6>
MacPorts </projects/macports>
Ports system for Mac OS
_______________________________________________
macports-tickets mailing list
[hidden email]
http://lists.macosforge.org/mailman/listinfo/macports-tickets
Reply | Threaded
Open this post in threaded view
|

Re: #13042: bazaar don't build on Leopard

Calendar and Contacts Server
#13042: bazaar don't build on Leopard
----------------------------------+-----------------------------------------
  Reporter:  [hidden email]  |       Owner:  [hidden email]
      Type:  defect               |      Status:  new                    
  Priority:  Normal               |   Milestone:  Port Bugs              
 Component:  ports                |     Version:  1.5.2                  
Resolution:                       |    Keywords:                          
----------------------------------+-----------------------------------------
Comment (by [hidden email]):

 Yes, I'm using the latest base from the release_1_6 branch. If I go back
 to base from the release_1_5_2 tag then bazaar installs without issue.

 So it looks like a problem with 1.6

--
Ticket URL: <http://trac.macosforge.org/projects/macports/ticket/13042#comment:7>
MacPorts </projects/macports>
Ports system for Mac OS
_______________________________________________
macports-tickets mailing list
[hidden email]
http://lists.macosforge.org/mailman/listinfo/macports-tickets
Reply | Threaded
Open this post in threaded view
|

Re: #13042: bazaar don't build on Leopard

Calendar and Contacts Server
In reply to this post by Calendar and Contacts Server
#13042: bazaar don't build on Leopard
----------------------------------+-----------------------------------------
  Reporter:  [hidden email]  |       Owner:  [hidden email]
      Type:  defect               |      Status:  closed                  
  Priority:  Normal               |   Milestone:  Port Bugs              
 Component:  ports                |     Version:  1.5.2                  
Resolution:  fixed                |    Keywords:                          
----------------------------------+-----------------------------------------
Changes (by [hidden email]):

  * status:  new => closed
  * resolution:  => fixed

Old description:

> Some C language error.
>
> /opt/local/var/macports/build/_opt_local_var_macports_sources_rsync.macports.org_trunk_dports_devel_bazaar/work/[hidden email]
> ---dists--bazaar--1.4/src/baz/libarch/archive-pfs.c:2000: warning:
> pointer targets in passing argument 1 of 'safe_open' differ in
> signedness/opt/local/var/macports/build/_opt_local_var_macports_sources_rsync.macports.org_trunk_dports_devel_bazaar/work/[hidden email]
> ---dists--bazaar--1.4/src/baz/libarch/archive-pfs.c:2011: warning:
> pointer targets in passing argument 1 of 'safe_unlink' differ in
> signedness/opt/local/var/macports/build/_opt_local_var_macports_sources_rsync.macports.org_trunk_dports_devel_bazaar/work/[hidden email]
> ---dists--bazaar--1.4/src/baz/libarch/archive-pfs.c: In function
> 'pfs_create_signature_file':/opt/local/var/macports/build/_opt_local_var_macports_sources_rsync.macports.org_trunk_dports_devel_bazaar/work/[hidden email]
> ---dists--bazaar--1.4/src/baz/libarch/archive-pfs.c:2024: warning:
> pointer targets in passing argument 1 of 'tmp_file_name_in_tmp' differ in
> signedness/opt/local/var/macports/build/_opt_local_var_macports_sources_rsync.macports.org_trunk_dports_devel_bazaar/work/[hidden email]
> ---dists--bazaar--1.4/src/baz/libarch/archive-pfs.c:2025: warning:
> pointer targets in passing argument 1 of 'safe_open' differ in
> signedness/opt/local/var/macports/build/_opt_local_var_macports_sources_rsync.macports.org_trunk_dports_devel_bazaar/work/[hidden email]
> ---dists--bazaar--1.4/src/baz/libarch/archive-pfs.c: In function
> 'pfs_finish_signature_file':/opt/local/var/macports/build/_opt_local_var_macports_sources_rsync.macports.org_trunk_dports_devel_bazaar/work/[hidden email]
> ---dists--bazaar--1.4/src/baz/libarch/archive-pfs.c:2064: warning:
> pointer targets in passing argument 5 of
> 'pfs_finish_signature_file_worker' differ in
> signedness/opt/local/var/macports/build/_opt_local_var_macports_sources_rsync.macports.org_trunk_dports_devel_bazaar/work/[hidden email]
> ---dists--bazaar--1.4/src/baz/libarch/archive-pfs.c: In function
> 'pfs_finish_signature_file_worker':/opt/local/var/macports/build/_opt_local_var_macports_sources_rsync.macports.org_trunk_dports_devel_bazaar/work/[hidden email]
> ---dists--bazaar--1.4/src/baz/libarch/archive-pfs.c:2117: warning:
> pointer targets in passing argument 1 of 'safe_open' differ in
> signedness/opt/local/var/macports/build/_opt_local_var_macports_sources_rsync.macports.org_trunk_dports_devel_bazaar/work/[hidden email]
> ---dists--bazaar--1.4/src/baz/libarch/archive-pfs.c:2118: warning:
> pointer targets in passing argument 1 of 'safe_open' differ in
> signedness/opt/local/var/macports/build/_opt_local_var_macports_sources_rsync.macports.org_trunk_dports_devel_bazaar/work/[hidden email]
> ---dists--bazaar--1.4/src/baz/libarch/archive-pfs.c:2119: warning:
> pointer targets in passing argument 1 of 'safe_unlink' differ in
> signedness
> /opt/local/var/macports/build/_opt_local_var_macports_sources_rsync.macports.org_trunk_dports_devel_bazaar/work/[hidden email]
> ---dists--bazaar--1.4/src/baz/libarch/archive-pfs.c:2126: warning:
> pointer targets in passing argument 1 of 'safe_unlink' differ in
> signedness/opt/local/var/macports/build/_opt_local_var_macports_sources_rsync.macports.org_trunk_dports_devel_bazaar/work/[hidden email]
> ---dists--bazaar--1.4/src/baz/libarch/archive-pfs.c:2171: warning:
> pointer targets in passing argument 1 of 'safe_unlink' differ in
> signedness/opt/local/var/macports/build/_opt_local_var_macports_sources_rsync.macports.org_trunk_dports_devel_bazaar/work/[hidden email]
> ---dists--bazaar--1.4/src/baz/libarch/archive-pfs.c: In function
> 'insert_sums':/opt/local/var/macports/build/_opt_local_var_macports_sources_rsync.macports.org_trunk_dports_devel_bazaar/work/[hidden email]
> ---dists--bazaar--1.4/src/baz/libarch/archive-pfs.c:2196: warning:
> pointer targets in passing argument 1 of 'safe_open' differ in
> signedness/opt/local/var/macports/build/_opt_local_var_macports_sources_rsync.macports.org_trunk_dports_devel_bazaar/work/[hidden email]
> ---dists--bazaar--1.4/src/baz/libarch/archive-pfs.c: In function
> 'pfs_set_mirror':/opt/local/var/macports/build/_opt_local_var_macports_sources_rsync.macports.org_trunk_dports_devel_bazaar/work/[hidden email]
> ---dists--bazaar--1.4/src/baz/libarch/archive-pfs.c:2246: warning:
> pointer targets in passing argument 3 of
> 'arch_pfs_set_file_contents_in_dir' differ in
> signedness/opt/local/var/macports/build/_opt_local_var_macports_sources_rsync.macports.org_trunk_dports_devel_bazaar/work/[hidden email]
> ---dists--bazaar--1.4/src/baz/libarch/archive-pfs.c:2249: warning:
> pointer targets in passing argument 2 of 'str_save' differ in
> signedness/opt/local/var/macports/build/_opt_local_var_macports_sources_rsync.macports.org_trunk_dports_devel_bazaar/work/[hidden email]
> ---dists--bazaar--1.4/src/baz/libarch/archive-pfs.c:2256: warning:
> pointer targets in passing argument 2 of
> 'arch_fs_archive_meta_info_item_path' differ in
> signedness/opt/local/var/macports/build/_opt_local_var_macports_sources_rsync.macports.org_trunk_dports_devel_bazaar/work/[hidden email]
> ---dists--bazaar--1.4/src/baz/libarch/archive-pfs.c:2260: warning:
> pointer targets in passing argument 2 of 'str_save' differ in
> signednessmake[2]: *** [archive-pfs.o] Error 1make[1]: *** [all] Error
> 2make: *** [all] Error 2Warning: the following items did not execute (for
> bazaar): org.macports.activate org.macports.build org.macports.destroot
> org.macports.installError: Status 1 encountered during processing.

New description:

 Some C language error.

 {{{
 /opt/local/var/macports/build/_opt_local_var_macports_sources_rsync.macports.org_trunk_dports_devel_bazaar/work/[hidden email]
 ---dists--bazaar--1.4/src/baz/libarch/archive-pfs.c:2000: warning: pointer
 targets in passing argument 1 of 'safe_open' differ in
 signedness/opt/local/var/macports/build/_opt_local_var_macports_sources_rsync.macports.org_trunk_dports_devel_bazaar/work/[hidden email]
 ---dists--bazaar--1.4/src/baz/libarch/archive-pfs.c:2011: warning: pointer
 targets in passing argument 1 of 'safe_unlink' differ in
 signedness/opt/local/var/macports/build/_opt_local_var_macports_sources_rsync.macports.org_trunk_dports_devel_bazaar/work/[hidden email]
 ---dists--bazaar--1.4/src/baz/libarch/archive-pfs.c: In function
 'pfs_create_signature_file':/opt/local/var/macports/build/_opt_local_var_macports_sources_rsync.macports.org_trunk_dports_devel_bazaar/work/[hidden email]
 ---dists--bazaar--1.4/src/baz/libarch/archive-pfs.c:2024: warning: pointer
 targets in passing argument 1 of 'tmp_file_name_in_tmp' differ in
 signedness/opt/local/var/macports/build/_opt_local_var_macports_sources_rsync.macports.org_trunk_dports_devel_bazaar/work/[hidden email]
 ---dists--bazaar--1.4/src/baz/libarch/archive-pfs.c:2025: warning: pointer
 targets in passing argument 1 of 'safe_open' differ in
 signedness/opt/local/var/macports/build/_opt_local_var_macports_sources_rsync.macports.org_trunk_dports_devel_bazaar/work/[hidden email]
 ---dists--bazaar--1.4/src/baz/libarch/archive-pfs.c: In function
 'pfs_finish_signature_file':/opt/local/var/macports/build/_opt_local_var_macports_sources_rsync.macports.org_trunk_dports_devel_bazaar/work/[hidden email]
 ---dists--bazaar--1.4/src/baz/libarch/archive-pfs.c:2064: warning: pointer
 targets in passing argument 5 of 'pfs_finish_signature_file_worker' differ
 in
 signedness/opt/local/var/macports/build/_opt_local_var_macports_sources_rsync.macports.org_trunk_dports_devel_bazaar/work/[hidden email]
 ---dists--bazaar--1.4/src/baz/libarch/archive-pfs.c: In function
 'pfs_finish_signature_file_worker':/opt/local/var/macports/build/_opt_local_var_macports_sources_rsync.macports.org_trunk_dports_devel_bazaar/work/[hidden email]
 ---dists--bazaar--1.4/src/baz/libarch/archive-pfs.c:2117: warning: pointer
 targets in passing argument 1 of 'safe_open' differ in
 signedness/opt/local/var/macports/build/_opt_local_var_macports_sources_rsync.macports.org_trunk_dports_devel_bazaar/work/[hidden email]
 ---dists--bazaar--1.4/src/baz/libarch/archive-pfs.c:2118: warning: pointer
 targets in passing argument 1 of 'safe_open' differ in
 signedness/opt/local/var/macports/build/_opt_local_var_macports_sources_rsync.macports.org_trunk_dports_devel_bazaar/work/[hidden email]
 ---dists--bazaar--1.4/src/baz/libarch/archive-pfs.c:2119: warning: pointer
 targets in passing argument 1 of 'safe_unlink' differ in signedness
 /opt/local/var/macports/build/_opt_local_var_macports_sources_rsync.macports.org_trunk_dports_devel_bazaar/work/[hidden email]
 ---dists--bazaar--1.4/src/baz/libarch/archive-pfs.c:2126: warning: pointer
 targets in passing argument 1 of 'safe_unlink' differ in
 signedness/opt/local/var/macports/build/_opt_local_var_macports_sources_rsync.macports.org_trunk_dports_devel_bazaar/work/[hidden email]
 ---dists--bazaar--1.4/src/baz/libarch/archive-pfs.c:2171: warning: pointer
 targets in passing argument 1 of 'safe_unlink' differ in
 signedness/opt/local/var/macports/build/_opt_local_var_macports_sources_rsync.macports.org_trunk_dports_devel_bazaar/work/[hidden email]
 ---dists--bazaar--1.4/src/baz/libarch/archive-pfs.c: In function
 'insert_sums':/opt/local/var/macports/build/_opt_local_var_macports_sources_rsync.macports.org_trunk_dports_devel_bazaar/work/[hidden email]
 ---dists--bazaar--1.4/src/baz/libarch/archive-pfs.c:2196: warning: pointer
 targets in passing argument 1 of 'safe_open' differ in
 signedness/opt/local/var/macports/build/_opt_local_var_macports_sources_rsync.macports.org_trunk_dports_devel_bazaar/work/[hidden email]
 ---dists--bazaar--1.4/src/baz/libarch/archive-pfs.c: In function
 'pfs_set_mirror':/opt/local/var/macports/build/_opt_local_var_macports_sources_rsync.macports.org_trunk_dports_devel_bazaar/work/[hidden email]
 ---dists--bazaar--1.4/src/baz/libarch/archive-pfs.c:2246: warning: pointer
 targets in passing argument 3 of 'arch_pfs_set_file_contents_in_dir'
 differ in
 signedness/opt/local/var/macports/build/_opt_local_var_macports_sources_rsync.macports.org_trunk_dports_devel_bazaar/work/[hidden email]
 ---dists--bazaar--1.4/src/baz/libarch/archive-pfs.c:2249: warning: pointer
 targets in passing argument 2 of 'str_save' differ in
 signedness/opt/local/var/macports/build/_opt_local_var_macports_sources_rsync.macports.org_trunk_dports_devel_bazaar/work/[hidden email]
 ---dists--bazaar--1.4/src/baz/libarch/archive-pfs.c:2256: warning: pointer
 targets in passing argument 2 of 'arch_fs_archive_meta_info_item_path'
 differ in
 signedness/opt/local/var/macports/build/_opt_local_var_macports_sources_rsync.macports.org_trunk_dports_devel_bazaar/work/[hidden email]
 ---dists--bazaar--1.4/src/baz/libarch/archive-pfs.c:2260: warning: pointer
 targets in passing argument 2 of 'str_save' differ in signednessmake[2]:
 *** [archive-pfs.o] Error 1make[1]: *** [all] Error 2make: *** [all] Error
 2Warning: the following items did not execute (for bazaar):
 org.macports.activate org.macports.build org.macports.destroot
 org.macports.installError: Status 1 encountered during processing.
 }}}

Comment:

 Please take a look at r31808 where I corrected the bug that kept this port
 from building with MacPorts > 1.5.2. In short, it worked back then only
 thanks to a bug in the environment parser (if I'm not mistaken) that was
 corrected in r30273 for 1.6. Nested quoting in environment declarations is
 illegal.

 -jmpp

--
Ticket URL: <http://trac.macosforge.org/projects/macports/ticket/13042#comment:8>
MacPorts </projects/macports>
Ports system for Mac OS
_______________________________________________
macports-tickets mailing list
[hidden email]
http://lists.macosforge.org/mailman/listinfo/macports-tickets