MacPorts

MacPorts is a free/open source software project to simplify installation of other free/open source software on macOS. With MacPorts you can install any of thousands of software packages by simply running sudo port install packagename in the Terminal, which will then download and install that software and its dependencies.
123456 ... 2193
Topics (76753)
Replies Last Post Views Sub Forum
#60930: Failed to build gpgme: command execution failed by macports-4
7
by macports-4
MacPorts - Tickets
[MacPorts] #55445: rdeps doesn't report perl5.24 for fftw-3 by macports-4
11
by macports-4
MacPorts - Tickets
[MacPorts] #54893: python35: fails to build due to "dyld: Symbol not found: _utimensat" by macports-4
26
by macports-4
MacPorts - Tickets
Re: #52438: lua-luabitop @1.0.2_1 cannot build without setting 'configure.sdkroot' on Sierra by macports-4
0
by macports-4
MacPorts - Tickets
[MacPorts] #57996: ncmpc @0.33_0: failed build by macports-4
6
by macports-4
MacPorts - Tickets
X11.bin Error opening or reading file by Christoph Kukulies
4
by ryandesign2
MacPorts - Users
Re: #44988: gnuradio-next: error: sys/soundcard.h: No such file or directory by macports-4
0
by macports-4
MacPorts - Tickets
#60898: neomutt fails to build on PPC Leopard by macports-4
9
by macports-4
MacPorts - Tickets
#59647: Catalina: neomutt cannot access $HOME/Maildir for directory browsing by macports-4
9
by macports-4
MacPorts - Tickets
#60927: inkscape 0.92.5_2 +x11: build failure by macports-4
16
by macports-4
MacPorts - Tickets
#59255: syncthing: fails to build under catalina by macports-4
13
by macports-4
MacPorts - Tickets
#60960: py-tensorflow version 2.3.0 fails to build: java.io.IOException: Cannot run program… Too many open files by macports-4
2
by macports-4
MacPorts - Tickets
#60926: gtk2 +quartz -x11 build failure by macports-4
17
by macports-4
MacPorts - Tickets
Failed to build gpgme: command execution failed - #60930 by FritzS - gmx
4
by Peter Hancock
MacPorts - Users
#60931: (10.9) mpv : build failed by macports-4
12
by macports-4
MacPorts - Tickets
#60955: `py38-scikit-learn` depends on `threadpoolctl`. by macports-4
3
by macports-4
MacPorts - Tickets
#60793: kremlin-devel: cc1: error: unrecognized command line option "-std=c11" by macports-4
4
by macports-4
MacPorts - Tickets
#60957: scons: Update to version 4.0.1 by macports-4
4
by macports-4
MacPorts - Tickets
#59303: Scons should not require python2 by macports-4
5
by macports-4
MacPorts - Tickets
#60959: openssh-8.1p1_9+gsskex+kerberos5+xauth config failure by macports-4
5
by macports-4
MacPorts - Tickets
#60347: p5.28-socket6 @0.290.0 : Build failure in Catalina by macports-4
4
by macports-4
MacPorts - Tickets
#59992: ncurses@6.1 : /opt/local/include/unctrl.h:60:63: error: unknown type name 'SCREEN' by macports-4
30
by macports-4
MacPorts - Tickets
#60958: Inkscape v_92.5+x11 Build Failure by macports-4
5
by macports-4
MacPorts - Tickets
Poisoned Savannah Mirror List by Fred Wright
1
by Christopher Chavez
MacPorts - Developer
github portal hacked? by Lenore Horner-2
2
by Clemens Lang-2
MacPorts - Users
#60956: inkscape 0.92.5_2 +x11: Undefined symbols for architecture x86_64: _libiconv, _libiconv_close, and _libiconv_open by macports-4
5
by macports-4
MacPorts - Tickets
Workarounds for cross compiling to Windows? by Ces VLC
8
by Ces VLC
MacPorts - Users
Build clang in stages? And how to run "make check-all" by Ces VLC
1
by Ken Cunningham
MacPorts - Users
#60838: Update mono from 6.8.0.123 to 6.10.0.104 stable by macports-4
5
by macports-4
MacPorts - Tickets
#60744: zmq @4.3.2_1: Warning: violation by /opt/local/doc by macports-4
1
by macports-4
MacPorts - Tickets
#60953: atlas @3.10.2_2: failed to build on Catalina by macports-4
4
by macports-4
MacPorts - Tickets
[MacPorts] #54342: atlas @3.10.2_2: update to 3.10.3 by macports-4
3
by macports-4
MacPorts - Tickets
com.apple.quarantine attribute on MacPorts files? by Richard L. Hamilton-...
3
by Richard L. Hamilton-...
MacPorts - Users
How enable ftp to localhost wordpress site? by Murray Eisenberg-2
14
by Bill Cole
MacPorts - Users
#60952: py27-notebook: Error: Dependency 'py27-argon2-cffi' not found. by macports-4
1
by macports-4
MacPorts - Tickets
123456 ... 2193