MacPorts - Tickets

This forum is an archive for the mailing list macports-tickets@lists.macports.org (more options) Messages posted here will be sent to this mailing list.
MacPorts Trac tickets.
1234 ... 1616
Topics (56553)
Replies Last Post Views
#60291: clang-devel @devel-r365158_1+analyzer+assertions+libstdcxx build failure by macports-4
9
by macports-4
#60301: py-pyficache: checksum mismatch by macports-4
0
by macports-4
#60294: rspamd @2.4: error: unknown type name '_Noreturn' by macports-4
3
by macports-4
Re: #49046: rcs @5.9.4: error: '_Noreturn' keyword must precede function declarator by macports-4
0
by macports-4
#60300: petsc @3.12.4: clang: error: unable to execute command: Segmentation fault: 11 by macports-4
0
by macports-4
#60273: mail-server installs /Library/LaunchDaemons/org.macports.logrotate.plist not registered to port by macports-4
4
by macports-4
#60297: signing-party: @2.10_1: wants to use an uninstalled python version / also could be switched to python 3 by macports-4
4
by macports-4
#60299: py38-jupyterlab @2.0.1_1 : Can't start the server. "pkg_resources.DistributionNotFound: The 'requests' distribution was not found and is required by jupyterlab-server" by macports-4
2
by macports-4
#60230: Failed to activate libarchive by macports-4
12
by macports-4
#60298: cgal5 fails to build by macports-4
2
by macports-4
#58946: Staging of swig-python3 fails by macports-4
9
by macports-4
#60287: boost @1.71.0 does not build: clang: error: unknown argument: '-fcoalesce-templates' by macports-4
8
by macports-4
#60196: clang-3.7: libcompiler_rt.a: No such file or directory by macports-4
8
by macports-4
#59927: bison @3.5 does not build on PPC Tiger, Mac OS X 10.4.11, because "#pragma GCC diagnostic not allowed inside functions" by macports-4
20
by macports-4
#59278: packages mirror 404 fco.it.packages.macports.org by macports-4
7
by macports-4
#60296: acpica: ld: library not found for -lMacportsLegacySupport by macports-4
0
by macports-4
#58709: prometheus @2.11.0: Unable to initialize project info by macports-4
16
by macports-4
#60293: pipx +python36 depends on nonexistent py36-argcomplete by macports-4
1
by macports-4
#60295: mbedtls: error: /usr/bin/ranlib: unknown option character `n' in: -no_warning_for_no_symbols by macports-4
1
by macports-4
#59928: OLA-0.10.7 not installing on MacOSX Mojave by macports-4
3
by macports-4
#59585: port install ola +libftdi0 fails by macports-4
5
by macports-4
#60266: moreutils needs p5.28-xml-sax by macports-4
4
by macports-4
#60292: dot2tex @2.11.3 : support other python versions beyond 3.7? by macports-4
1
by macports-4
#60281: Error: Failed to configure clang-3.7: llvm-3.7 must be installed without +assertions. by macports-4
9
by macports-4
#60290: py37-numpy: import failed by macports-4
3
by macports-4
#60085: Viking failed to build on Mojave by macports-4
7
by macports-4
#60283: octave: automake-1.15: command not found by macports-4
1
by macports-4
#59556: Undefined symbols for Boost 1.71.0_1 on 10.6.8 by macports-4
7
by macports-4
#60289: netcdf @4.7.3: update to 4.7.4 by macports-4
1
by macports-4
#60238: pysam samtools pysam-0.15.4-py2.7 read permissions problem by macports-4
2
by macports-4
#60288: Unable to install dsniff on macOS 10.15.3 by macports-4
1
by macports-4
#60277: librsvg @2.48.1: `port test` fails with "undefined symbols" by macports-4
5
by macports-4
#60285: gnutls fails to build because of -no_weak_imports by macports-4
9
by macports-4
#60220: librsvg @2.48.0_0 +x11: ld: symbol(s) not found for architecture x86_64 by macports-4
25
by macports-4
#60286: py27-pygtk needs newer nm by macports-4
0
by macports-4
1234 ... 1616