[MacPorts] #57465: h3dphysics @1.3.0: error: no member named 'm_limitSoftness' in 'btRotationalLimitMotor2'

classic Classic list List threaded Threaded
2 messages Options
Reply | Threaded
Open this post in threaded view
|

[MacPorts] #57465: h3dphysics @1.3.0: error: no member named 'm_limitSoftness' in 'btRotationalLimitMotor2'

MacPorts
#57465: h3dphysics @1.3.0: error: no member named 'm_limitSoftness' in
'btRotationalLimitMotor2'
------------------------+------------------------
 Reporter:  ryandesign  |      Owner:  support@…
     Type:  defect      |     Status:  assigned
 Priority:  Normal      |  Milestone:
Component:  ports       |    Version:
 Keywords:              |       Port:  h3dphysics
------------------------+------------------------
 [https://build.macports.org/builders/ports-10.14_x86_64-builder/builds/8403/steps
 /install-port/logs/stdio h3dphysics does not build]:

 {{{
 [  7%] Building CXX object
 CMakeFiles/H3DPhysics.dir/opt/local/var/macports/build/_opt_bblocal_var_buildworker_ports_build_ports_graphics_h3dphysics/h3dphysics/work/h3dphysics-1.3.0/src/BulletWorldOptions.o
 /usr/bin/clang++  -DH3DPHYSICS_EXPORTS -DH3DPhysics_EXPORTS
 -I/opt/local/var/macports/build/_opt_bblocal_var_buildworker_ports_build_ports_graphics_h3dphysics/h3dphysics/work/build/include
 -I/opt/local/var/macports/build/_opt_bblocal_var_buildworker_ports_build_ports_graphics_h3dphysics/h3dphysics/work/h3dphysics-1.3.0/build/../include
 -I/opt/local/include
 -F/Applications/Xcode.app/Contents/Developer/Platforms/MacOSX.platform/Developer/SDKs/MacOSX10.14.sdk/System/Library/Frameworks
 -I/opt/local/include/bullet
 -I/Applications/Xcode.app/Contents/Developer/Platforms/MacOSX.platform/Developer/SDKs/MacOSX10.14.sdk/usr/include/python2.7
 -pipe -Os -stdlib=libc++
 -isysroot/Applications/Xcode.app/Contents/Developer/Platforms/MacOSX.platform/Developer/SDKs/MacOSX10.14.sdk
 -DNDEBUG -arch x86_64 -isysroot
 /Applications/Xcode.app/Contents/Developer/Platforms/MacOSX.platform/Developer/SDKs/MacOSX10.14.sdk
 -mmacosx-version-min=10.14 -fPIC   -I/opt/local/include -o
 CMakeFiles/H3DPhysics.dir/opt/local/var/macports/build/_opt_bblocal_var_buildworker_ports_build_ports_graphics_h3dphysics/h3dphysics/work/h3dphysics-1.3.0/src/BulletWorldOptions.o
 -c
 /opt/local/var/macports/build/_opt_bblocal_var_buildworker_ports_build_ports_graphics_h3dphysics/h3dphysics/work/h3dphysics-1.3.0/src/BulletWorldOptions.cpp
 /opt/local/var/macports/build/_opt_bblocal_var_buildworker_ports_build_ports_graphics_h3dphysics/h3dphysics/work/h3dphysics-1.3.0/src/BulletJoints.cpp:570:51:
 error: no member named 'm_limitSoftness' in 'btRotationalLimitMotor2'
     doubleHingeJoint->getRotationalLimitMotor(2)->m_limitSoftness=
 btScalar ( doubleHingeJointParameters->getStopBounce1() );
     ~~~~~~~~~~~~~~~~~~~~~~~~~~~~~~~~~~~~~~~~~~~~  ^
 /opt/local/var/macports/build/_opt_bblocal_var_buildworker_ports_build_ports_graphics_h3dphysics/h3dphysics/work/h3dphysics-1.3.0/src/BulletCallbacks.cpp:922:18:
 warning: enumeration values 'UNIT_EDGE' and 'UNIT_ELEMENT' not handled in
 switch [-Wswitch]
         switch ( output->getUnitType() ) {
                  ^
 /opt/local/var/macports/build/_opt_bblocal_var_buildworker_ports_build_ports_graphics_h3dphysics/h3dphysics/work/h3dphysics-1.3.0/src/BulletCallbacks.cpp:922:18:
 note: add missing switch cases
         switch ( output->getUnitType() ) {
                  ^
 /opt/local/var/macports/build/_opt_bblocal_var_buildworker_ports_build_ports_graphics_h3dphysics/h3dphysics/work/h3dphysics-1.3.0/src/BulletCallbacks.cpp:933:18:
 warning: enumeration values 'UNIT_EDGE' and 'UNIT_ELEMENT' not handled in
 switch [-Wswitch]
         switch ( output->getUnitType() ) {
                  ^
 /opt/local/var/macports/build/_opt_bblocal_var_buildworker_ports_build_ports_graphics_h3dphysics/h3dphysics/work/h3dphysics-1.3.0/src/BulletCallbacks.cpp:933:18:
 note: add missing switch cases
         switch ( output->getUnitType() ) {
                  ^
 /opt/local/var/macports/build/_opt_bblocal_var_buildworker_ports_build_ports_graphics_h3dphysics/h3dphysics/work/h3dphysics-1.3.0/src/BulletCallbacks.cpp:919:14:
 warning: enumeration values 'OUTPUT_INTERACTION_FORCE_MAGNITUDE' and
 'OUTPUT_EXTERNAL_FORCE_MAGNITUDE' not handled in switch [-Wswitch]
     switch ( output->getOutputType() ) {
              ^
 /opt/local/var/macports/build/_opt_bblocal_var_buildworker_ports_build_ports_graphics_h3dphysics/h3dphysics/work/h3dphysics-1.3.0/src/BulletCallbacks.cpp:919:14:
 note: add missing switch cases
     switch ( output->getOutputType() ) {
              ^
 /opt/local/var/macports/build/_opt_bblocal_var_buildworker_ports_build_ports_graphics_h3dphysics/h3dphysics/work/h3dphysics-1.3.0/src/BulletCallbacks.cpp:952:18:
 warning: enumeration values 'UNIT_EDGE' and 'UNIT_ELEMENT' not handled in
 switch [-Wswitch]
         switch ( output->getUnitType() ) {
                  ^
 /opt/local/var/macports/build/_opt_bblocal_var_buildworker_ports_build_ports_graphics_h3dphysics/h3dphysics/work/h3dphysics-1.3.0/src/BulletCallbacks.cpp:952:18:
 note: add missing switch cases
         switch ( output->getUnitType() ) {
                  ^
 /opt/local/var/macports/build/_opt_bblocal_var_buildworker_ports_build_ports_graphics_h3dphysics/h3dphysics/work/h3dphysics-1.3.0/src/BulletCallbacks.cpp:963:18:
 warning: enumeration values 'UNIT_EDGE' and 'UNIT_ELEMENT' not handled in
 switch [-Wswitch]
         switch ( output->getUnitType() ) {
                  ^
 /opt/local/var/macports/build/_opt_bblocal_var_buildworker_ports_build_ports_graphics_h3dphysics/h3dphysics/work/h3dphysics-1.3.0/src/BulletCallbacks.cpp:963:18:
 note: add missing switch cases
         switch ( output->getUnitType() ) {
                  ^
 /opt/local/var/macports/build/_opt_bblocal_var_buildworker_ports_build_ports_graphics_h3dphysics/h3dphysics/work/h3dphysics-1.3.0/src/BulletCallbacks.cpp:949:14:
 warning: enumeration values 'OUTPUT_INTERACTION_FORCE' and
 'OUTPUT_EXTERNAL_FORCE' not handled in switch [-Wswitch]
     switch ( output->getOutputType() ) {
              ^
 /opt/local/var/macports/build/_opt_bblocal_var_buildworker_ports_build_ports_graphics_h3dphysics/h3dphysics/work/h3dphysics-1.3.0/src/BulletCallbacks.cpp:949:14:
 note: add missing switch cases
     switch ( output->getOutputType() ) {
              ^
 /opt/local/var/macports/build/_opt_bblocal_var_buildworker_ports_build_ports_graphics_h3dphysics/h3dphysics/work/h3dphysics-1.3.0/src/BulletCallbacks.cpp:2170:10:
 error: no member named 'm_contactCFM1' in 'btManifoldPoint'; did you mean
 'm_contactCFM'?
       cp.m_contactCFM1= p.softness_constant_force_mix;
          ^~~~~~~~~~~~~
          m_contactCFM
 /opt/local/include/bullet/BulletCollision/NarrowPhaseCollision/btManifoldPoint.h:126:27:
 note: 'm_contactCFM' declared here
                 btScalar                m_contactCFM;
                                         ^
 /opt/local/var/macports/build/_opt_bblocal_var_buildworker_ports_build_ports_graphics_h3dphysics/h3dphysics/work/h3dphysics-1.3.0/src/BulletCallbacks.cpp:2171:10:
 error: no member named 'm_contactCFM2' in 'btManifoldPoint'; did you mean
 'm_contactCFM'?
       cp.m_contactCFM2= p.softness_constant_force_mix;
          ^~~~~~~~~~~~~
          m_contactCFM
 /opt/local/include/bullet/BulletCollision/NarrowPhaseCollision/btManifoldPoint.h:126:27:
 note: 'm_contactCFM' declared here
                 btScalar                m_contactCFM;
                                         ^
 [  8%] Building CXX object
 CMakeFiles/H3DPhysics.dir/opt/local/var/macports/build/_opt_bblocal_var_buildworker_ports_build_ports_graphics_h3dphysics/h3dphysics/work/h3dphysics-1.3.0/src/Cloth.o
 /usr/bin/clang++  -DH3DPHYSICS_EXPORTS -DH3DPhysics_EXPORTS
 -I/opt/local/var/macports/build/_opt_bblocal_var_buildworker_ports_build_ports_graphics_h3dphysics/h3dphysics/work/build/include
 -I/opt/local/var/macports/build/_opt_bblocal_var_buildworker_ports_build_ports_graphics_h3dphysics/h3dphysics/work/h3dphysics-1.3.0/build/../include
 -I/opt/local/include
 -F/Applications/Xcode.app/Contents/Developer/Platforms/MacOSX.platform/Developer/SDKs/MacOSX10.14.sdk/System/Library/Frameworks
 -I/opt/local/include/bullet
 -I/Applications/Xcode.app/Contents/Developer/Platforms/MacOSX.platform/Developer/SDKs/MacOSX10.14.sdk/usr/include/python2.7
 -pipe -Os -stdlib=libc++
 -isysroot/Applications/Xcode.app/Contents/Developer/Platforms/MacOSX.platform/Developer/SDKs/MacOSX10.14.sdk
 -DNDEBUG -arch x86_64 -isysroot
 /Applications/Xcode.app/Contents/Developer/Platforms/MacOSX.platform/Developer/SDKs/MacOSX10.14.sdk
 -mmacosx-version-min=10.14 -fPIC   -I/opt/local/include -o
 CMakeFiles/H3DPhysics.dir/opt/local/var/macports/build/_opt_bblocal_var_buildworker_ports_build_ports_graphics_h3dphysics/h3dphysics/work/h3dphysics-1.3.0/src/Cloth.o
 -c
 /opt/local/var/macports/build/_opt_bblocal_var_buildworker_ports_build_ports_graphics_h3dphysics/h3dphysics/work/h3dphysics-1.3.0/src/Cloth.cpp
 1 error generated.
 make[2]: ***
 [CMakeFiles/H3DPhysics.dir/opt/local/var/macports/build/_opt_bblocal_var_buildworker_ports_build_ports_graphics_h3dphysics/h3dphysics/work/h3dphysics-1.3.0/src/BulletJoints.o]
 Error 1
 make[2]: *** Waiting for unfinished jobs....
 6 warnings and 2 errors generated.
 }}}

--
Ticket URL: <https://trac.macports.org/ticket/57465>
MacPorts <https://www.macports.org/>
Ports system for macOS
Reply | Threaded
Open this post in threaded view
|

Re: [MacPorts] #57465: h3dphysics @1.3.0: error: no member named 'm_limitSoftness' in 'btRotationalLimitMotor2'

MacPorts
#57465: h3dphysics @1.3.0: error: no member named 'm_limitSoftness' in
'btRotationalLimitMotor2'
-------------------------+-----------------------
  Reporter:  ryandesign  |      Owner:  support@…
      Type:  defect      |     Status:  closed
  Priority:  Normal      |  Milestone:
 Component:  ports       |    Version:
Resolution:  fixed       |   Keywords:
      Port:  h3dphysics  |
-------------------------+-----------------------
Changes (by jjandersson <44439490+jjandersson@…>):

 * status:  assigned => closed
 * resolution:   => fixed


Comment:

 In [changeset:"163c15de78f0738e62cbf28cdc9f4a79a4d044ca/macports-ports"
 163c15de78f0738e62cbf28cdc9f4a79a4d044ca/macports-ports] (master):
 {{{
 #!ConfigurableCommitTicketReference repository="macports-ports"
 revision="163c15de78f0738e62cbf28cdc9f4a79a4d044ca"
 h3dphysics: patches for upgraded Bullet+ODE

 * variable used in BulletCallbacks changed name
 * function called from BulletJoints obsoleted
 * type in ODECallbacks changed to const

 Closes: https://trac.macports.org/ticket/57465
 }}}

--
Ticket URL: <https://trac.macports.org/ticket/57465#comment:1>
MacPorts <https://www.macports.org/>
Ports system for macOS