Quantcast

[MacPorts] #53231: QGIS @2_18_2_2 build failure

classic Classic list List threaded Threaded
54 messages Options
123
Reply | Threaded
Open this post in threaded view
|  
Report Content as Inappropriate

Re: [MacPorts] #53231: QGIS @2_18_2_2 build failure

MacPorts
#53231: QGIS @2_18_2_2 build failure
-----------------------+----------------------
  Reporter:  gcarlino  |      Owner:  Veence
      Type:  defect    |     Status:  assigned
  Priority:  Normal    |  Milestone:
 Component:  ports     |    Version:  2.3.5
Resolution:            |   Keywords:
      Port:  QGIS      |
-----------------------+----------------------

Comment (by Veence):

 I’ve attached the new version of the Portfile, along with some tinkering I
 had to do with QWT. It’s raw, and I apologise about that. I had planned to
 sort everything out once I had a clean build, which did not happen yet.
 Please by all means give a shot at it, and report any problem here. I’m
 sorry I didn’t listen much during the previous days, I was snowed under
 somewhat.

--
Ticket URL: <https://trac.macports.org/ticket/53231#comment:23>
MacPorts <https://www.macports.org/>
Ports system for macOS
Reply | Threaded
Open this post in threaded view
|  
Report Content as Inappropriate

Re: [MacPorts] #53231: QGIS @2_18_2_2 build failure

MacPorts
In reply to this post by MacPorts
#53231: QGIS @2_18_2_2 build failure
-----------------------+----------------------
  Reporter:  gcarlino  |      Owner:  Veence
      Type:  defect    |     Status:  assigned
  Priority:  Normal    |  Milestone:
 Component:  ports     |    Version:  2.3.5
Resolution:            |   Keywords:
      Port:  QGIS      |
-----------------------+----------------------

Comment (by akhenakh):

 Not sure if it can help, but the folks maintaining QGIS for Arch suffered
 the same compilation issues, but recently a 2.18.3 ports landed and
 compile against qt4.

 https://aur.archlinux.org/cgit/aur.git/tree/PKGBUILD?h=qgis

--
Ticket URL: <https://trac.macports.org/ticket/53231#comment:24>
MacPorts <https://www.macports.org/>
Ports system for macOS
Reply | Threaded
Open this post in threaded view
|  
Report Content as Inappropriate

Re: [MacPorts] #53231: QGIS @2_18_2_2 build failure

MacPorts
In reply to this post by MacPorts
#53231: QGIS @2_18_2_2 build failure
-----------------------+----------------------
  Reporter:  gcarlino  |      Owner:  Veence
      Type:  defect    |     Status:  assigned
  Priority:  Normal    |  Milestone:
 Component:  ports     |    Version:  2.3.5
Resolution:            |   Keywords:
      Port:  QGIS      |
-----------------------+----------------------

Comment (by akhenakh):

 Relevant patch seems to be
 https://github.com/qgis/QGIS/commit/718581ffb12b723f9a3c0ae01b7ec2d8aed9d4bb.patch

--
Ticket URL: <https://trac.macports.org/ticket/53231#comment:25>
MacPorts <https://www.macports.org/>
Ports system for macOS
Reply | Threaded
Open this post in threaded view
|  
Report Content as Inappropriate

Re: [MacPorts] #53231: QGIS @2_18_2_2 build failure

MacPorts
In reply to this post by MacPorts
#53231: QGIS @2_18_2_2 build failure
-----------------------+----------------------
  Reporter:  gcarlino  |      Owner:  Veence
      Type:  defect    |     Status:  assigned
  Priority:  Normal    |  Milestone:
 Component:  ports     |    Version:  2.3.5
Resolution:            |   Keywords:
      Port:  QGIS      |
-----------------------+----------------------

Comment (by cmutel):

 Created pull request to apply this patch: https://github.com/macports
 /macports-ports/pull/318. Compiles cleanly on my machine (10.11.6).

--
Ticket URL: <https://trac.macports.org/ticket/53231#comment:27>
MacPorts <https://www.macports.org/>
Ports system for macOS
Reply | Threaded
Open this post in threaded view
|  
Report Content as Inappropriate

Re: [MacPorts] #53231: QGIS @2_18_2_2 build failure

MacPorts
In reply to this post by MacPorts
#53231: QGIS @2_18_2_2 build failure
-----------------------+----------------------
  Reporter:  gcarlino  |      Owner:  Veence
      Type:  defect    |     Status:  assigned
  Priority:  Normal    |  Milestone:
 Component:  ports     |    Version:  2.3.5
Resolution:            |   Keywords:
      Port:  QGIS      |
-----------------------+----------------------

Comment (by akhenakh):

 Hey Chris tested your pull and it works. Thanks.

--
Ticket URL: <https://trac.macports.org/ticket/53231#comment:28>
MacPorts <https://www.macports.org/>
Ports system for macOS
Reply | Threaded
Open this post in threaded view
|  
Report Content as Inappropriate

Re: [MacPorts] #53231: QGIS @2_18_2_2 build failure

MacPorts
In reply to this post by MacPorts
#53231: QGIS @2_18_2_2 build failure
-----------------------+----------------------
  Reporter:  gcarlino  |      Owner:  Veence
      Type:  defect    |     Status:  assigned
  Priority:  Normal    |  Milestone:
 Component:  ports     |    Version:  2.3.5
Resolution:            |   Keywords:
      Port:  QGIS      |
-----------------------+----------------------

Comment (by cmutel):

 Replying to [comment:28 akhenakh]:
 > Hey Chris tested your pull and it works. Thanks. (10.12.3)

 Actually, you get most of the credit - I just turned your suggestion into
 a patch and a delta to the Portfile.

--
Ticket URL: <https://trac.macports.org/ticket/53231#comment:29>
MacPorts <https://www.macports.org/>
Ports system for macOS
Reply | Threaded
Open this post in threaded view
|  
Report Content as Inappropriate

Re: [MacPorts] #53231: QGIS @2_18_2_2 build failure

MacPorts
In reply to this post by MacPorts
#53231: QGIS @2_18_2_2 build failure
-----------------------+----------------------
  Reporter:  gcarlino  |      Owner:  Veence
      Type:  defect    |     Status:  assigned
  Priority:  Normal    |  Milestone:
 Component:  ports     |    Version:  2.3.5
Resolution:            |   Keywords:
      Port:  QGIS      |
-----------------------+----------------------

Comment (by akhenakh):

 Team work!

--
Ticket URL: <https://trac.macports.org/ticket/53231#comment:30>
MacPorts <https://www.macports.org/>
Ports system for macOS
Reply | Threaded
Open this post in threaded view
|  
Report Content as Inappropriate

Re: [MacPorts] #53231: QGIS @2_18_2_2 build failure

MacPorts
In reply to this post by MacPorts
#53231: QGIS @2_18_2_2 build failure
-----------------------+----------------------
  Reporter:  gcarlino  |      Owner:  Veence
      Type:  defect    |     Status:  assigned
  Priority:  Normal    |  Milestone:
 Component:  ports     |    Version:  2.3.5
Resolution:            |   Keywords:
      Port:  QGIS      |
-----------------------+----------------------

Comment (by basmac):

 QGIS on Sierra still fails for me after an outdated update Feb 16.
 end of log file

 make[2]: Leaving directory
 `/opt/local/var/macports/build/_opt_local_var_macports_sources_rsync.macports.org_release_tarballs_ports_gis_qgis/QGIS/work
 /QGIS-2_18_2/build'
 [ 54%] Built target qgis_gui
 make[1]: Leaving directory
 `/opt/local/var/macports/build/_opt_local_var_macports_sources_rsync.macports.org_release_tarballs_ports_gis_qgis/QGIS/work
 /QGIS-2_18_2/build'
 make: *** [all] Error 2
 make: Leaving directory
 `/opt/local/var/macports/build/_opt_local_var_macports_sources_rsync.macports.org_release_tarballs_ports_gis_qgis/QGIS/work
 /QGIS-2_18_2/build'
 Command failed:  cd
 "/opt/local/var/macports/build/_opt_local_var_macports_sources_rsync.macports.org_release_tarballs_ports_gis_qgis/QGIS/work
 /QGIS-2_18_2/build" && /usr/bin/make -j8 -w all VERBOSE=ON
 Exit code: 2
 Error: Failed to build QGIS: command execution failed
 DEBUG: Error code: CHILDSTATUS 63185 2
 DEBUG: Backtrace: command execution failed
     while executing
 "system {*}$notty {*}$nice $fullcmdstring"
     invoked from within
 "command_exec build"
     (procedure "portbuild::build_main" line 8)
     invoked from within
 "$procedure $targetname"
 Error: See
 /opt/local/var/macports/logs/_opt_local_var_macports_sources_rsync.macports.org_release_tarballs_ports_gis_qgis/QGIS/main.log
 for details.
 Error: Follow https://guide.macports.org/#project.tickets to report a bug.
 Error: Processing of port QGIS failed
 [mac27:/Volumes/User/bmcinnes] root#

--
Ticket URL: <https://trac.macports.org/ticket/53231#comment:31>
MacPorts <https://www.macports.org/>
Ports system for macOS
Reply | Threaded
Open this post in threaded view
|  
Report Content as Inappropriate

Re: [MacPorts] #53231: QGIS @2_18_2_2 build failure

MacPorts
In reply to this post by MacPorts
#53231: QGIS @2_18_2_2 build failure
-----------------------+----------------------
  Reporter:  gcarlino  |      Owner:  Veence
      Type:  defect    |     Status:  assigned
  Priority:  Normal    |  Milestone:
 Component:  ports     |    Version:  2.3.5
Resolution:            |   Keywords:
      Port:  QGIS      |
-----------------------+----------------------

Comment (by plablo09):

 I'm seeing the exact same error, also on Sierra

--
Ticket URL: <https://trac.macports.org/ticket/53231#comment:32>
MacPorts <https://www.macports.org/>
Ports system for macOS
Reply | Threaded
Open this post in threaded view
|  
Report Content as Inappropriate

Re: [MacPorts] #53231: QGIS @2_18_2_2 build failure

MacPorts
In reply to this post by MacPorts
#53231: QGIS @2_18_2_2 build failure
-----------------------+----------------------
  Reporter:  gcarlino  |      Owner:  Veence
      Type:  defect    |     Status:  assigned
  Priority:  Normal    |  Milestone:
 Component:  ports     |    Version:  2.3.5
Resolution:            |   Keywords:
      Port:  QGIS      |
-----------------------+----------------------

Comment (by edhackett):

 Chris, tested your pull, works for me too. However, on startup, I got an
 error "Couldn't load plugin processing due to an error when calling its
 classFactory() method" and caused the Processing Plugin not to load.
 Following the stack trace, I replaced "SagaUtils.py" with another copy
 from a different machine and upon restart the Processing Plugin loaded
 successfully. I'll upload  a copy of the stack trace and a diff file for
 SagaUtils.py

--
Ticket URL: <https://trac.macports.org/ticket/53231#comment:33>
MacPorts <https://www.macports.org/>
Ports system for macOS
Reply | Threaded
Open this post in threaded view
|  
Report Content as Inappropriate

Re: [MacPorts] #53231: QGIS @2_18_2_2 build failure

MacPorts
In reply to this post by MacPorts
#53231: QGIS @2_18_2_2 build failure
-----------------------+----------------------
  Reporter:  gcarlino  |      Owner:  Veence
      Type:  defect    |     Status:  assigned
  Priority:  Normal    |  Milestone:
 Component:  ports     |    Version:  2.3.5
Resolution:            |   Keywords:
      Port:  QGIS      |
-----------------------+----------------------
Changes (by edhackett):

 * Attachment "stacktrace.txt" added.


--
Ticket URL: <https://trac.macports.org/ticket/53231>
MacPorts <https://www.macports.org/>
Ports system for macOS
Reply | Threaded
Open this post in threaded view
|  
Report Content as Inappropriate

Re: [MacPorts] #53231: QGIS @2_18_2_2 build failure

MacPorts
In reply to this post by MacPorts
#53231: QGIS @2_18_2_2 build failure
-----------------------+----------------------
  Reporter:  gcarlino  |      Owner:  Veence
      Type:  defect    |     Status:  assigned
  Priority:  Normal    |  Milestone:
 Component:  ports     |    Version:  2.3.5
Resolution:            |   Keywords:
      Port:  QGIS      |
-----------------------+----------------------
Changes (by edhackett):

 * Attachment "SagaUtils.py.diff" added.


--
Ticket URL: <https://trac.macports.org/ticket/53231>
MacPorts <https://www.macports.org/>
Ports system for macOS
Reply | Threaded
Open this post in threaded view
|  
Report Content as Inappropriate

Re: [MacPorts] #53231: QGIS @2_18_2_2 build failure

MacPorts
In reply to this post by MacPorts
#53231: QGIS @2_18_2_2 build failure
-----------------------+----------------------
  Reporter:  gcarlino  |      Owner:  Veence
      Type:  defect    |     Status:  assigned
  Priority:  Normal    |  Milestone:
 Component:  ports     |    Version:  2.3.5
Resolution:            |   Keywords:
      Port:  QGIS      |
-----------------------+----------------------

Comment (by basmac):

 After port upgrade outdated (Feb 21) and port clean, on Sierra QGIS still
 fails to install.

 End of debug log below -

 /usr/bin/clang++   -pipe -Os -stdlib=libc++ -DSPATIALITE_VERSION_GE_4_0_0
 -DSPATIALITE_VERSION_G_4_1_1 -DSPATIALITE_HAS_INIT_EX -std=c++11 -Wno-
 error=c++11-narrowing -Wall -Wextra -Wno-long-long -Wformat-security -Wno-
 strict-aliasing -Wno-return-type-c-linkage -Wno-overloaded-virtual
 -Qunused-arguments -DNDEBUG -arch x86_64 -mmacosx-version-min=10.12
 -Wl,-search_paths_first -Wl,-headerpad_max_install_names -L/opt/local/lib
 -Wl,-headerpad_max_install_names -Qunused-arguments -F/Library/Frameworks
 CMakeFiles/qgis_composerobject.dir/testqgscomposerobject.cpp.o
 CMakeFiles/qgis_composerobject.dir/qgis_composerobject_automoc.cpp.o  -o
 ../../../output/bin/qgis_composerobject
 -L/opt/local/var/macports/build/_opt_local_var_macports_sources_rsync.macports.org_release_tarballs_ports_gis_qgis/QGIS/work
 /QGIS-2_18_2/build/src/core
 -L/opt/local/var/macports/build/_opt_local_var_macports_sources_rsync.macports.org_release_tarballs_ports_gis_qgis/QGIS/work
 /QGIS-2_18_2/build/src/gui -Wl,-rpath,/opt/local/lib
 /opt/local/libexec/qt4/lib/libQtXml.dylib
 /opt/local/libexec/qt4/lib/libQtCore.dylib
 /opt/local/libexec/qt4/lib/libQtSvg.dylib
 /opt/local/libexec/qt4/lib/libQtTest.dylib /opt/local/lib/libproj.dylib
 /opt/local/lib/libgeos_c.dylib /opt/local/lib/libgdal.dylib
 ../../../output/lib/qgis_core.framework/Versions/2.18/qgis_core -framework
 CoreFoundation -framework IOKit /opt/local/libexec/qt4/lib/libQtXml.dylib
 /opt/local/libexec/qt4/lib/libQtCore.dylib
 /opt/local/libexec/qt4/lib/libQtGui.dylib
 /opt/local/libexec/qt4/lib/libQtNetwork.dylib
 /opt/local/libexec/qt4/lib/libQtSvg.dylib
 /opt/local/libexec/qt4/lib/libQtWebKit.dylib
 /opt/local/libexec/qt4/lib/libQtSql.dylib
 /opt/local/libexec/qt4/lib/libqca.dylib /opt/local/lib/libproj.dylib
 /opt/local/lib/libgeos_c.dylib /opt/local/lib/libgdal.dylib
 /opt/local/lib/libspatialindex.dylib /opt/local/lib/libexpat.dylib
 /opt/local/lib/libsqlite3.dylib /opt/local/lib/libspatialite.dylib
 /opt/local/var/macports/build/_opt_local_var_macports_sources_rsync.macports.org_release_tarballs_ports_gis_qgis/QGIS/work
 /QGIS-2_18_2/build/python/core/sip_corepart1.cpp:86365:9: error: virtual
 function 'dataType' has a different return type ('int') than the function
 it overrides (which has return type 'QGis::DataType')
     int dataType(int) const;
     ~~~ ^
 /opt/local/var/macports/build/_opt_local_var_macports_sources_rsync.macports.org_release_tarballs_ports_gis_qgis/QGIS/work
 /QGIS-2_18_2/python/../src/core/raster/qgsrasterprojector.h:101:20: note:
 overridden virtual function is here
     QGis::DataType dataType( int bandNo ) const override;
     ~~~~~~~~~~~~~~ ^
 make[2]: Leaving directory
 `/opt/local/var/macports/build/_opt_local_var_macports_sources_rsync.macports.org_release_tarballs_ports_gis_qgis/QGIS/work
 /QGIS-2_18_2/build'
 [ 33%] Built target qgis_composerobject
 [ 33%] Building CXX object
 tests/src/core/CMakeFiles/qgis_maprotationtest.dir/qgis_maprotationtest_automoc.cpp.o
 cd
 /opt/local/var/macports/build/_opt_local_var_macports_sources_rsync.macports.org_release_tarballs_ports_gis_qgis/QGIS/work
 /QGIS-2_18_2/build/tests/src/core && /usr/bin/clang++   -DENABLE_TESTS
 -DQT_CORE_LIB -DQT_GUI_LIB -DQT_NETWORK_LIB -DQT_NO_CAST_TO_ASCII
 -DQT_NO_DEBUG -DQT_SQL_LIB -DQT_SVG_LIB -DQT_WEBKIT_LIB -DQT_XML_LIB
 -DWITH_QTWEBKIT -isystem /opt/local/libexec/qt4/include -isystem
 /opt/local/libexec/qt4/include/QtSvg -isystem
 /opt/local/libexec/qt4/include/QtWebKit -isystem
 /opt/local/libexec/qt4/include/QtGui -isystem
 /opt/local/libexec/qt4/include/QtXml -isystem
 /opt/local/libexec/qt4/include/QtSql -isystem
 /opt/local/libexec/qt4/include/QtNetwork -isystem
 /opt/local/libexec/qt4/include/QtCore
 -I/opt/local/var/macports/build/_opt_local_var_macports_sources_rsync.macports.org_release_tarballs_ports_gis_qgis/QGIS/work
 /QGIS-2_18_2/build
 -I/opt/local/var/macports/build/_opt_local_var_macports_sources_rsync.macports.org_release_tarballs_ports_gis_qgis/QGIS/work
 /QGIS-2_18_2/tests/src/core
 -I/opt/local/var/macports/build/_opt_local_var_macports_sources_rsync.macports.org_release_tarballs_ports_gis_qgis/QGIS/work
 /QGIS-2_18_2/build/tests/src/core
 -I/opt/local/var/macports/build/_opt_local_var_macports_sources_rsync.macports.org_release_tarballs_ports_gis_qgis/QGIS/work
 /QGIS-2_18_2/src/core
 -I/opt/local/var/macports/build/_opt_local_var_macports_sources_rsync.macports.org_release_tarballs_ports_gis_qgis/QGIS/work
 /QGIS-2_18_2/src/core/auth
 -I/opt/local/var/macports/build/_opt_local_var_macports_sources_rsync.macports.org_release_tarballs_ports_gis_qgis/QGIS/work
 /QGIS-2_18_2/src/core/composer
 -I/opt/local/var/macports/build/_opt_local_var_macports_sources_rsync.macports.org_release_tarballs_ports_gis_qgis/QGIS/work
 /QGIS-2_18_2/src/core/geometry
 -I/opt/local/var/macports/build/_opt_local_var_macports_sources_rsync.macports.org_release_tarballs_ports_gis_qgis/QGIS/work
 /QGIS-2_18_2/src/core/effects
 -I/opt/local/var/macports/build/_opt_local_var_macports_sources_rsync.macports.org_release_tarballs_ports_gis_qgis/QGIS/work
 /QGIS-2_18_2/src/core/layertree
 -I/opt/local/var/macports/build/_opt_local_var_macports_sources_rsync.macports.org_release_tarballs_ports_gis_qgis/QGIS/work
 /QGIS-2_18_2/src/core/raster
 -I/opt/local/var/macports/build/_opt_local_var_macports_sources_rsync.macports.org_release_tarballs_ports_gis_qgis/QGIS/work
 /QGIS-2_18_2/src/core/symbology-ng -isystem /opt/local/include -isystem
 /opt/local/libexec/qt4/include/QtCrypto  -pipe -Os -stdlib=libc++
 -DSPATIALITE_VERSION_GE_4_0_0 -DSPATIALITE_VERSION_G_4_1_1
 -DSPATIALITE_HAS_INIT_EX -std=c++11 -Wno-error=c++11-narrowing -Wall
 -Wextra -Wno-long-long -Wformat-security -Wno-strict-aliasing -Wno-return-
 type-c-linkage -Wno-overloaded-virtual -Qunused-arguments -DNDEBUG -arch
 x86_64 -mmacosx-version-min=10.12 -fvisibility=hidden   -DCORE_EXPORT=
 -DGUI_EXPORT= -DPYTHON_EXPORT= -DANALYSIS_EXPORT= -DAPP_EXPORT=
 -DCUSTOMWIDGETS_EXPORT= -DSERVER_EXPORT=
 -DTEST_DATA_DIR="\"/opt/local/var/macports/build/_opt_local_var_macports_sources_rsync.macports.org_release_tarballs_ports_gis_qgis/QGIS/work
 /QGIS-2_18_2/tests/testdata\""
 -DINSTALL_PREFIX="\"/Applications/MacPorts/QGIS.app/Contents/MacOS\"" -o
 CMakeFiles/qgis_maprotationtest.dir/qgis_maprotationtest_automoc.cpp.o -c
 /opt/local/var/macports/build/_opt_local_var_macports_sources_rsync.macports.org_release_tarballs_ports_gis_qgis/QGIS/work
 /QGIS-2_18_2/build/tests/src/core/qgis_maprotationtest_automoc.cpp
 [ 33%] Building CXX object
 tests/src/core/CMakeFiles/qgis_linefillsymboltest.dir/qgis_linefillsymboltest_automoc.cpp.o
 cd
 /opt/local/var/macports/build/_opt_local_var_macports_sources_rsync.macports.org_release_tarballs_ports_gis_qgis/QGIS/work
 /QGIS-2_18_2/build/tests/src/core && /usr/bin/clang++   -DENABLE_TESTS
 -DQT_CORE_LIB -DQT_GUI_LIB -DQT_NETWORK_LIB -DQT_NO_CAST_TO_ASCII
 -DQT_NO_DEBUG -DQT_SQL_LIB -DQT_SVG_LIB -DQT_WEBKIT_LIB -DQT_XML_LIB
 -DWITH_QTWEBKIT -isystem /opt/local/libexec/qt4/include -isystem
 /opt/local/libexec/qt4/include/QtSvg -isystem
 /opt/local/libexec/qt4/include/QtWebKit -isystem
 /opt/local/libexec/qt4/include/QtGui -isystem
 /opt/local/libexec/qt4/include/QtXml -isystem
 /opt/local/libexec/qt4/include/QtSql -isystem
 /opt/local/libexec/qt4/include/QtNetwork -isystem
 /opt/local/libexec/qt4/include/QtCore
 -I/opt/local/var/macports/build/_opt_local_var_macports_sources_rsync.macports.org_release_tarballs_ports_gis_qgis/QGIS/work
 /QGIS-2_18_2/build
 -I/opt/local/var/macports/build/_opt_local_var_macports_sources_rsync.macports.org_release_tarballs_ports_gis_qgis/QGIS/work
 /QGIS-2_18_2/tests/src/core
 -I/opt/local/var/macports/build/_opt_local_var_macports_sources_rsync.macports.org_release_tarballs_ports_gis_qgis/QGIS/work
 /QGIS-2_18_2/build/tests/src/core
 -I/opt/local/var/macports/build/_opt_local_var_macports_sources_rsync.macports.org_release_tarballs_ports_gis_qgis/QGIS/work
 /QGIS-2_18_2/src/core
 -I/opt/local/var/macports/build/_opt_local_var_macports_sources_rsync.macports.org_release_tarballs_ports_gis_qgis/QGIS/work
 /QGIS-2_18_2/src/core/auth
 -I/opt/local/var/macports/build/_opt_local_var_macports_sources_rsync.macports.org_release_tarballs_ports_gis_qgis/QGIS/work
 /QGIS-2_18_2/src/core/composer
 -I/opt/local/var/macports/build/_opt_local_var_macports_sources_rsync.macports.org_release_tarballs_ports_gis_qgis/QGIS/work
 /QGIS-2_18_2/src/core/geometry
 -I/opt/local/var/macports/build/_opt_local_var_macports_sources_rsync.macports.org_release_tarballs_ports_gis_qgis/QGIS/work
 /QGIS-2_18_2/src/core/effects
 -I/opt/local/var/macports/build/_opt_local_var_macports_sources_rsync.macports.org_release_tarballs_ports_gis_qgis/QGIS/work
 /QGIS-2_18_2/src/core/layertree
 -I/opt/local/var/macports/build/_opt_local_var_macports_sources_rsync.macports.org_release_tarballs_ports_gis_qgis/QGIS/work
 /QGIS-2_18_2/src/core/raster
 -I/opt/local/var/macports/build/_opt_local_var_macports_sources_rsync.macports.org_release_tarballs_ports_gis_qgis/QGIS/work
 /QGIS-2_18_2/src/core/symbology-ng -isystem /opt/local/include -isystem
 /opt/local/libexec/qt4/include/QtCrypto  -pipe -Os -stdlib=libc++
 -DSPATIALITE_VERSION_GE_4_0_0 -DSPATIALITE_VERSION_G_4_1_1
 -DSPATIALITE_HAS_INIT_EX -std=c++11 -Wno-error=c++11-narrowing -Wall
 -Wextra -Wno-long-long -Wformat-security -Wno-strict-aliasing -Wno-return-
 type-c-linkage -Wno-overloaded-virtual -Qunused-arguments -DNDEBUG -arch
 x86_64 -mmacosx-version-min=10.12 -fvisibility=hidden   -DCORE_EXPORT=
 -DGUI_EXPORT= -DPYTHON_EXPORT= -DANALYSIS_EXPORT= -DAPP_EXPORT=
 -DCUSTOMWIDGETS_EXPORT= -DSERVER_EXPORT=
 -DTEST_DATA_DIR="\"/opt/local/var/macports/build/_opt_local_var_macports_sources_rsync.macports.org_release_tarballs_ports_gis_qgis/QGIS/work
 /QGIS-2_18_2/tests/testdata\""
 -DINSTALL_PREFIX="\"/Applications/MacPorts/QGIS.app/Contents/MacOS\"" -o
 CMakeFiles/qgis_linefillsymboltest.dir/qgis_linefillsymboltest_automoc.cpp.o
 -c
 /opt/local/var/macports/build/_opt_local_var_macports_sources_rsync.macports.org_release_tarballs_ports_gis_qgis/QGIS/work
 /QGIS-2_18_2/build/tests/src/core/qgis_linefillsymboltest_automoc.cpp
 /Applications/Xcode.app/Contents/Developer/usr/bin/make -f
 tests/src/core/CMakeFiles/qgis_svgmarkertest.dir/build.make
 tests/src/core/CMakeFiles/qgis_svgmarkertest.dir/depend
 make[2]: Entering directory
 `/opt/local/var/macports/build/_opt_local_var_macports_sources_rsync.macports.org_release_tarballs_ports_gis_qgis/QGIS/work
 /QGIS-2_18_2/build'
 cd
 /opt/local/var/macports/build/_opt_local_var_macports_sources_rsync.macports.org_release_tarballs_ports_gis_qgis/QGIS/work
 /QGIS-2_18_2/build && /opt/local/bin/cmake -E cmake_depends "Unix
 Makefiles"
 /opt/local/var/macports/build/_opt_local_var_macports_sources_rsync.macports.org_release_tarballs_ports_gis_qgis/QGIS/work
 /QGIS-2_18_2
 /opt/local/var/macports/build/_opt_local_var_macports_sources_rsync.macports.org_release_tarballs_ports_gis_qgis/QGIS/work
 /QGIS-2_18_2/tests/src/core
 /opt/local/var/macports/build/_opt_local_var_macports_sources_rsync.macports.org_release_tarballs_ports_gis_qgis/QGIS/work
 /QGIS-2_18_2/build
 /opt/local/var/macports/build/_opt_local_var_macports_sources_rsync.macports.org_release_tarballs_ports_gis_qgis/QGIS/work
 /QGIS-2_18_2/build/tests/src/core
 /opt/local/var/macports/build/_opt_local_var_macports_sources_rsync.macports.org_release_tarballs_ports_gis_qgis/QGIS/work
 /QGIS-
 2_18_2/build/tests/src/core/CMakeFiles/qgis_svgmarkertest.dir/DependInfo.cmake
 --color=
 make[2]: Leaving directory
 `/opt/local/var/macports/build/_opt_local_var_macports_sources_rsync.macports.org_release_tarballs_ports_gis_qgis/QGIS/work
 /QGIS-2_18_2/build'
 /Applications/Xcode.app/Contents/Developer/usr/bin/make -f
 src/gui/CMakeFiles/qgis_gui.dir/build.make
 src/gui/CMakeFiles/qgis_gui.dir/build
 Dependee
 "/opt/local/var/macports/build/_opt_local_var_macports_sources_rsync.macports.org_release_tarballs_ports_gis_qgis/QGIS/work
 /QGIS-
 2_18_2/build/tests/src/core/CMakeFiles/qgis_svgmarkertest.dir/DependInfo.cmake"
 is newer than depender
 "/opt/local/var/macports/build/_opt_local_var_macports_sources_rsync.macports.org_release_tarballs_ports_gis_qgis/QGIS/work
 /QGIS-
 2_18_2/build/tests/src/core/CMakeFiles/qgis_svgmarkertest.dir/depend.internal".
 Dependee
 "/opt/local/var/macports/build/_opt_local_var_macports_sources_rsync.macports.org_release_tarballs_ports_gis_qgis/QGIS/work
 /QGIS-
 2_18_2/build/tests/src/core/CMakeFiles/CMakeDirectoryInformation.cmake" is
 newer than depender
 "/opt/local/var/macports/build/_opt_local_var_macports_sources_rsync.macports.org_release_tarballs_ports_gis_qgis/QGIS/work
 /QGIS-
 2_18_2/build/tests/src/core/CMakeFiles/qgis_svgmarkertest.dir/depend.internal".
 Scanning dependencies of target qgis_svgmarkertest
 make[2]: Leaving directory
 `/opt/local/var/macports/build/_opt_local_var_macports_sources_rsync.macports.org_release_tarballs_ports_gis_qgis/QGIS/work
 /QGIS-2_18_2/build'
 /Applications/Xcode.app/Contents/Developer/usr/bin/make -f
 tests/src/core/CMakeFiles/qgis_svgmarkertest.dir/build.make
 tests/src/core/CMakeFiles/qgis_svgmarkertest.dir/build
 make[2]: Entering directory
 `/opt/local/var/macports/build/_opt_local_var_macports_sources_rsync.macports.org_release_tarballs_ports_gis_qgis/QGIS/work
 /QGIS-2_18_2/build'
 [ 33%] Building CXX object
 tests/src/core/CMakeFiles/qgis_svgmarkertest.dir/testqgssvgmarker.cpp.o
 cd
 /opt/local/var/macports/build/_opt_local_var_macports_sources_rsync.macports.org_release_tarballs_ports_gis_qgis/QGIS/work
 /QGIS-2_18_2/build/tests/src/core && /usr/bin/clang++   -DENABLE_TESTS
 -DQT_CORE_LIB -DQT_GUI_LIB -DQT_NETWORK_LIB -DQT_NO_CAST_TO_ASCII
 -DQT_NO_DEBUG -DQT_SQL_LIB -DQT_SVG_LIB -DQT_WEBKIT_LIB -DQT_XML_LIB
 -DWITH_QTWEBKIT -isystem /opt/local/libexec/qt4/include -isystem
 /opt/local/libexec/qt4/include/QtSvg -isystem
 /opt/local/libexec/qt4/include/QtWebKit -isystem
 /opt/local/libexec/qt4/include/QtGui -isystem
 /opt/local/libexec/qt4/include/QtXml -isystem
 /opt/local/libexec/qt4/include/QtSql -isystem
 /opt/local/libexec/qt4/include/QtNetwork -isystem
 /opt/local/libexec/qt4/include/QtCore
 -I/opt/local/var/macports/build/_opt_local_var_macports_sources_rsync.macports.org_release_tarballs_ports_gis_qgis/QGIS/work
 /QGIS-2_18_2/build
 -I/opt/local/var/macports/build/_opt_local_var_macports_sources_rsync.macports.org_release_tarballs_ports_gis_qgis/QGIS/work
 /QGIS-2_18_2/tests/src/core
 -I/opt/local/var/macports/build/_opt_local_var_macports_sources_rsync.macports.org_release_tarballs_ports_gis_qgis/QGIS/work
 /QGIS-2_18_2/build/tests/src/core
 -I/opt/local/var/macports/build/_opt_local_var_macports_sources_rsync.macports.org_release_tarballs_ports_gis_qgis/QGIS/work
 /QGIS-2_18_2/src/core
 -I/opt/local/var/macports/build/_opt_local_var_macports_sources_rsync.macports.org_release_tarballs_ports_gis_qgis/QGIS/work
 /QGIS-2_18_2/src/core/auth
 -I/opt/local/var/macports/build/_opt_local_var_macports_sources_rsync.macports.org_release_tarballs_ports_gis_qgis/QGIS/work
 /QGIS-2_18_2/src/core/composer
 -I/opt/local/var/macports/build/_opt_local_var_macports_sources_rsync.macports.org_release_tarballs_ports_gis_qgis/QGIS/work
 /QGIS-2_18_2/src/core/geometry
 -I/opt/local/var/macports/build/_opt_local_var_macports_sources_rsync.macports.org_release_tarballs_ports_gis_qgis/QGIS/work
 /QGIS-2_18_2/src/core/effects
 -I/opt/local/var/macports/build/_opt_local_var_macports_sources_rsync.macports.org_release_tarballs_ports_gis_qgis/QGIS/work
 /QGIS-2_18_2/src/core/layertree
 -I/opt/local/var/macports/build/_opt_local_var_macports_sources_rsync.macports.org_release_tarballs_ports_gis_qgis/QGIS/work
 /QGIS-2_18_2/src/core/raster
 -I/opt/local/var/macports/build/_opt_local_var_macports_sources_rsync.macports.org_release_tarballs_ports_gis_qgis/QGIS/work
 /QGIS-2_18_2/src/core/symbology-ng -isystem /opt/local/include -isystem
 /opt/local/libexec/qt4/include/QtCrypto  -pipe -Os -stdlib=libc++
 -DSPATIALITE_VERSION_GE_4_0_0 -DSPATIALITE_VERSION_G_4_1_1
 -DSPATIALITE_HAS_INIT_EX -std=c++11 -Wno-error=c++11-narrowing -Wall
 -Wextra -Wno-long-long -Wformat-security -Wno-strict-aliasing -Wno-return-
 type-c-linkage -Wno-overloaded-virtual -Qunused-arguments -DNDEBUG -arch
 x86_64 -mmacosx-version-min=10.12 -fvisibility=hidden   -DCORE_EXPORT=
 -DGUI_EXPORT= -DPYTHON_EXPORT= -DANALYSIS_EXPORT= -DAPP_EXPORT=
 -DCUSTOMWIDGETS_EXPORT= -DSERVER_EXPORT=
 -DTEST_DATA_DIR="\"/opt/local/var/macports/build/_opt_local_var_macports_sources_rsync.macports.org_release_tarballs_ports_gis_qgis/QGIS/work
 /QGIS-2_18_2/tests/testdata\""
 -DINSTALL_PREFIX="\"/Applications/MacPorts/QGIS.app/Contents/MacOS\"" -o
 CMakeFiles/qgis_svgmarkertest.dir/testqgssvgmarker.cpp.o -c
 /opt/local/var/macports/build/_opt_local_var_macports_sources_rsync.macports.org_release_tarballs_ports_gis_qgis/QGIS/work
 /QGIS-2_18_2/tests/src/core/testqgssvgmarker.cpp
 EPSG 6966: not imported
 EPSG 7082: not imported
 /opt/local/var/macports/build/_opt_local_var_macports_sources_rsync.macports.org_release_tarballs_ports_gis_qgis/QGIS/work
 /QGIS-2_18_2/build/python/core/sip_corepart2.cpp:130711:114: error: call
 to implicitly-deleted copy constructor of
 '::QgsVectorLayerFeatureIterator'
 sipQgsVectorLayerFeatureIterator::sipQgsVectorLayerFeatureIterator(const
 ::QgsVectorLayerFeatureIterator& a0):
 ::QgsVectorLayerFeatureIterator(a0), sipPySelf(0)
 ^                               ~~
 /opt/local/var/macports/build/_opt_local_var_macports_sources_rsync.macports.org_release_tarballs_ports_gis_qgis/QGIS/work
 /QGIS-2_18_2/python/../src/core/qgsvectorlayerfeatureiterator.h:196:42:
 note: copy constructor of 'QgsVectorLayerFeatureIterator' is implicitly
 deleted because field 'mExpressionContext' has an inaccessible copy
 constructor
     QScopedPointer<QgsExpressionContext> mExpressionContext;
                                          ^
 /opt/local/var/macports/build/_opt_local_var_macports_sources_rsync.macports.org_release_tarballs_ports_gis_qgis/QGIS/work
 /QGIS-2_18_2/python/core/qgsexception.sip:8:19: error: use of undeclared
 identifier 'sipExportedExceptions__core'
   PyErr_SetString(sipException_QgsCsException,
 sipExceptionRef.what().toUtf8().constData() );
                   ^
 /opt/local/var/macports/build/_opt_local_var_macports_sources_rsync.macports.org_release_tarballs_ports_gis_qgis/QGIS/work
 /QGIS-2_18_2/build/python/core/sipAPI_core.h:20151:37: note: expanded from
 macro 'sipException_QgsCsException'
 #define sipException_QgsCsException sipExportedExceptions__core[0]
                                     ^
 /opt/local/var/macports/build/_opt_local_var_macports_sources_rsync.macports.org_release_tarballs_ports_gis_qgis/QGIS/work
 /QGIS-2_18_2/python/core/qgsexception.sip:8:19: error: use of undeclared
 identifier 'sipExportedExceptions__core'
   PyErr_SetString(sipException_QgsCsException,
 sipExceptionRef.what().toUtf8().constData() );
                   ^
 /opt/local/var/macports/build/_opt_local_var_macports_sources_rsync.macports.org_release_tarballs_ports_gis_qgis/QGIS/work
 /QGIS-2_18_2/build/python/core/sipAPI_core.h:20151:37: note: expanded from
 macro 'sipException_QgsCsException'
 #define sipException_QgsCsException sipExportedExceptions__core[0]
                                     ^
 /opt/local/var/macports/build/_opt_local_var_macports_sources_rsync.macports.org_release_tarballs_ports_gis_qgis/QGIS/work
 /QGIS-2_18_2/python/core/qgsexception.sip:8:19: error: use of undeclared
 identifier 'sipExportedExceptions__core'
   PyErr_SetString(sipException_QgsCsException,
 sipExceptionRef.what().toUtf8().constData() );
                   ^
 /opt/local/var/macports/build/_opt_local_var_macports_sources_rsync.macports.org_release_tarballs_ports_gis_qgis/QGIS/work
 /QGIS-2_18_2/build/python/core/sipAPI_core.h:20151:37: note: expanded from
 macro 'sipException_QgsCsException'
 #define sipException_QgsCsException sipExportedExceptions__core[0]
                                     ^
 make[2]: Entering directory
 `/opt/local/var/macports/build/_opt_local_var_macports_sources_rsync.macports.org_release_tarballs_ports_gis_qgis/QGIS/work
 /QGIS-2_18_2/build'
 make[2]: *** No rule to make target
 `/opt/local/libexec/qt4/lib/libqscintilla2.dylib', needed by
 `output/lib/qgis_gui.framework/Versions/2.18/qgis_gui'.  Stop.
 make[2]: Leaving directory
 `/opt/local/var/macports/build/_opt_local_var_macports_sources_rsync.macports.org_release_tarballs_ports_gis_qgis/QGIS/work
 /QGIS-2_18_2/build'
 /opt/local/var/macports/build/_opt_local_var_macports_sources_rsync.macports.org_release_tarballs_ports_gis_qgis/QGIS/work
 /QGIS-2_18_2/python/core/qgsexception.sip:8:19: error: use of undeclared
 identifier 'sipExportedExceptions__core'
   PyErr_SetString(sipException_QgsCsException,
 sipExceptionRef.what().toUtf8().constData() );
                   ^
 /opt/local/var/macports/build/_opt_local_var_macports_sources_rsync.macports.org_release_tarballs_ports_gis_qgis/QGIS/work
 /QGIS-2_18_2/build/python/core/sipAPI_core.h:20151:37: note: expanded from
 macro 'sipException_QgsCsException'
 #define sipException_QgsCsException sipExportedExceptions__core[0]
                                     ^
 make[1]: *** [src/gui/CMakeFiles/qgis_gui.dir/all] Error 2
 make[1]: *** Waiting for unfinished jobs....
 [ 33%] Building CXX object
 tests/src/core/CMakeFiles/qgis_svgmarkertest.dir/qgis_svgmarkertest_automoc.cpp.o
 cd
 /opt/local/var/macports/build/_opt_local_var_macports_sources_rsync.macports.org_release_tarballs_ports_gis_qgis/QGIS/work
 /QGIS-2_18_2/build/tests/src/core && /usr/bin/clang++   -DENABLE_TESTS
 -DQT_CORE_LIB -DQT_GUI_LIB -DQT_NETWORK_LIB -DQT_NO_CAST_TO_ASCII
 -DQT_NO_DEBUG -DQT_SQL_LIB -DQT_SVG_LIB -DQT_WEBKIT_LIB -DQT_XML_LIB
 -DWITH_QTWEBKIT -isystem /opt/local/libexec/qt4/include -isystem
 /opt/local/libexec/qt4/include/QtSvg -isystem
 /opt/local/libexec/qt4/include/QtWebKit -isystem
 /opt/local/libexec/qt4/include/QtGui -isystem
 /opt/local/libexec/qt4/include/QtXml -isystem
 /opt/local/libexec/qt4/include/QtSql -isystem
 /opt/local/libexec/qt4/include/QtNetwork -isystem
 /opt/local/libexec/qt4/include/QtCore
 -I/opt/local/var/macports/build/_opt_local_var_macports_sources_rsync.macports.org_release_tarballs_ports_gis_qgis/QGIS/work
 /QGIS-2_18_2/build
 -I/opt/local/var/macports/build/_opt_local_var_macports_sources_rsync.macports.org_release_tarballs_ports_gis_qgis/QGIS/work
 /QGIS-2_18_2/tests/src/core
 -I/opt/local/var/macports/build/_opt_local_var_macports_sources_rsync.macports.org_release_tarballs_ports_gis_qgis/QGIS/work
 /QGIS-2_18_2/build/tests/src/core
 -I/opt/local/var/macports/build/_opt_local_var_macports_sources_rsync.macports.org_release_tarballs_ports_gis_qgis/QGIS/work
 /QGIS-2_18_2/src/core
 -I/opt/local/var/macports/build/_opt_local_var_macports_sources_rsync.macports.org_release_tarballs_ports_gis_qgis/QGIS/work
 /QGIS-2_18_2/src/core/auth
 -I/opt/local/var/macports/build/_opt_local_var_macports_sources_rsync.macports.org_release_tarballs_ports_gis_qgis/QGIS/work
 /QGIS-2_18_2/src/core/composer
 -I/opt/local/var/macports/build/_opt_local_var_macports_sources_rsync.macports.org_release_tarballs_ports_gis_qgis/QGIS/work
 /QGIS-2_18_2/src/core/geometry
 -I/opt/local/var/macports/build/_opt_local_var_macports_sources_rsync.macports.org_release_tarballs_ports_gis_qgis/QGIS/work
 /QGIS-2_18_2/src/core/effects
 -I/opt/local/var/macports/build/_opt_local_var_macports_sources_rsync.macports.org_release_tarballs_ports_gis_qgis/QGIS/work
 /QGIS-2_18_2/src/core/layertree
 -I/opt/local/var/macports/build/_opt_local_var_macports_sources_rsync.macports.org_release_tarballs_ports_gis_qgis/QGIS/work
 /QGIS-2_18_2/src/core/raster
 -I/opt/local/var/macports/build/_opt_local_var_macports_sources_rsync.macports.org_release_tarballs_ports_gis_qgis/QGIS/work
 /QGIS-2_18_2/src/core/symbology-ng -isystem /opt/local/include -isystem
 /opt/local/libexec/qt4/include/QtCrypto  -pipe -Os -stdlib=libc++
 -DSPATIALITE_VERSION_GE_4_0_0 -DSPATIALITE_VERSION_G_4_1_1
 -DSPATIALITE_HAS_INIT_EX -std=c++11 -Wno-error=c++11-narrowing -Wall
 -Wextra -Wno-long-long -Wformat-security -Wno-strict-aliasing -Wno-return-
 type-c-linkage -Wno-overloaded-virtual -Qunused-arguments -DNDEBUG -arch
 x86_64 -mmacosx-version-min=10.12 -fvisibility=hidden   -DCORE_EXPORT=
 -DGUI_EXPORT= -DPYTHON_EXPORT= -DANALYSIS_EXPORT= -DAPP_EXPORT=
 -DCUSTOMWIDGETS_EXPORT= -DSERVER_EXPORT=
 -DTEST_DATA_DIR="\"/opt/local/var/macports/build/_opt_local_var_macports_sources_rsync.macports.org_release_tarballs_ports_gis_qgis/QGIS/work
 /QGIS-2_18_2/tests/testdata\""
 -DINSTALL_PREFIX="\"/Applications/MacPorts/QGIS.app/Contents/MacOS\"" -o
 CMakeFiles/qgis_svgmarkertest.dir/qgis_svgmarkertest_automoc.cpp.o -c
 /opt/local/var/macports/build/_opt_local_var_macports_sources_rsync.macports.org_release_tarballs_ports_gis_qgis/QGIS/work
 /QGIS-2_18_2/build/tests/src/core/qgis_svgmarkertest_automoc.cpp
 /opt/local/var/macports/build/_opt_local_var_macports_sources_rsync.macports.org_release_tarballs_ports_gis_qgis/QGIS/work
 /QGIS-2_18_2/python/core/qgsexception.sip:8:19: error: use of undeclared
 identifier 'sipExportedExceptions__core'
   PyErr_SetString(sipException_QgsCsException,
 sipExceptionRef.what().toUtf8().constData() );
                   ^
 /opt/local/var/macports/build/_opt_local_var_macports_sources_rsync.macports.org_release_tarballs_ports_gis_qgis/QGIS/work
 /QGIS-2_18_2/build/python/core/sipAPI_core.h:20151:37: note: expanded from
 macro 'sipException_QgsCsException'
 #define sipException_QgsCsException sipExportedExceptions__core[0]
                                     ^
 Loaded 4631/4709 from /opt/local/share/gdal/pcs.csv
 Loaded 182/183 from /opt/local/share/gdal/vertcs.csv
 /opt/local/var/macports/build/_opt_local_var_macports_sources_rsync.macports.org_release_tarballs_ports_gis_qgis/QGIS/work
 /QGIS-2_18_2/python/core/qgsexception.sip:8:19: error: use of undeclared
 identifier 'sipExportedExceptions__core'
   PyErr_SetString(sipException_QgsCsException,
 sipExceptionRef.what().toUtf8().constData() );
                   ^
 /opt/local/var/macports/build/_opt_local_var_macports_sources_rsync.macports.org_release_tarballs_ports_gis_qgis/QGIS/work
 /QGIS-2_18_2/build/python/core/sipAPI_core.h:20151:37: note: expanded from
 macro 'sipException_QgsCsException'
 #define sipException_QgsCsException sipExportedExceptions__core[0]
                                     ^
 Loaded 153/154 from /opt/local/share/gdal/compdcs.csv
 Loaded 148/149 from /opt/local/share/gdal/geoccs.csv
 Loading epsg.wkt
 Loading esri_extra.wkt
 6063 WKTs loaded
 [ 33%] Linking CXX executable ../../../output/bin/qgis_maprotationtest
 cd
 /opt/local/var/macports/build/_opt_local_var_macports_sources_rsync.macports.org_release_tarballs_ports_gis_qgis/QGIS/work
 /QGIS-2_18_2/build/tests/src/core && /opt/local/bin/cmake -E
 cmake_link_script CMakeFiles/qgis_maprotationtest.dir/link.txt
 --verbose=ON
 /usr/bin/clang++   -pipe -Os -stdlib=libc++ -DSPATIALITE_VERSION_GE_4_0_0
 -DSPATIALITE_VERSION_G_4_1_1 -DSPATIALITE_HAS_INIT_EX -std=c++11 -Wno-
 error=c++11-narrowing -Wall -Wextra -Wno-long-long -Wformat-security -Wno-
 strict-aliasing -Wno-return-type-c-linkage -Wno-overloaded-virtual
 -Qunused-arguments -DNDEBUG -arch x86_64 -mmacosx-version-min=10.12
 -Wl,-search_paths_first -Wl,-headerpad_max_install_names -L/opt/local/lib
 -Wl,-headerpad_max_install_names -Qunused-arguments -F/Library/Frameworks
 CMakeFiles/qgis_maprotationtest.dir/testqgsmaprotation.cpp.o
 CMakeFiles/qgis_maprotationtest.dir/qgis_maprotationtest_automoc.cpp.o  -o
 ../../../output/bin/qgis_maprotationtest
 -L/opt/local/var/macports/build/_opt_local_var_macports_sources_rsync.macports.org_release_tarballs_ports_gis_qgis/QGIS/work
 /QGIS-2_18_2/build/src/core
 -L/opt/local/var/macports/build/_opt_local_var_macports_sources_rsync.macports.org_release_tarballs_ports_gis_qgis/QGIS/work
 /QGIS-2_18_2/build/src/gui -Wl,-rpath,/opt/local/lib
 /opt/local/libexec/qt4/lib/libQtXml.dylib
 /opt/local/libexec/qt4/lib/libQtCore.dylib
 /opt/local/libexec/qt4/lib/libQtSvg.dylib
 /opt/local/libexec/qt4/lib/libQtTest.dylib /opt/local/lib/libproj.dylib
 /opt/local/lib/libgeos_c.dylib /opt/local/lib/libgdal.dylib
 ../../../output/lib/qgis_core.framework/Versions/2.18/qgis_core -framework
 CoreFoundation -framework IOKit /opt/local/libexec/qt4/lib/libQtXml.dylib
 /opt/local/libexec/qt4/lib/libQtCore.dylib
 /opt/local/libexec/qt4/lib/libQtGui.dylib
 /opt/local/libexec/qt4/lib/libQtNetwork.dylib
 /opt/local/libexec/qt4/lib/libQtSvg.dylib
 /opt/local/libexec/qt4/lib/libQtWebKit.dylib
 /opt/local/libexec/qt4/lib/libQtSql.dylib
 /opt/local/libexec/qt4/lib/libqca.dylib /opt/local/lib/libproj.dylib
 /opt/local/lib/libgeos_c.dylib /opt/local/lib/libgdal.dylib
 /opt/local/lib/libspatialindex.dylib /opt/local/lib/libexpat.dylib
 /opt/local/lib/libsqlite3.dylib /opt/local/lib/libspatialite.dylib
 [ 33%] Linking CXX executable ../../../output/bin/qgis_linefillsymboltest
 cd
 /opt/local/var/macports/build/_opt_local_var_macports_sources_rsync.macports.org_release_tarballs_ports_gis_qgis/QGIS/work
 /QGIS-2_18_2/build/tests/src/core && /opt/local/bin/cmake -E
 cmake_link_script CMakeFiles/qgis_linefillsymboltest.dir/link.txt
 --verbose=ON
 make[2]: Leaving directory
 `/opt/local/var/macports/build/_opt_local_var_macports_sources_rsync.macports.org_release_tarballs_ports_gis_qgis/QGIS/work
 /QGIS-2_18_2/build'
 /usr/bin/clang++   -pipe -Os -stdlib=libc++ -DSPATIALITE_VERSION_GE_4_0_0
 -DSPATIALITE_VERSION_G_4_1_1 -DSPATIALITE_HAS_INIT_EX -std=c++11 -Wno-
 error=c++11-narrowing -Wall -Wextra -Wno-long-long -Wformat-security -Wno-
 strict-aliasing -Wno-return-type-c-linkage -Wno-overloaded-virtual
 -Qunused-arguments -DNDEBUG -arch x86_64 -mmacosx-version-min=10.12
 -Wl,-search_paths_first -Wl,-headerpad_max_install_names -L/opt/local/lib
 -Wl,-headerpad_max_install_names -Qunused-arguments -F/Library/Frameworks
 CMakeFiles/qgis_linefillsymboltest.dir/testqgslinefillsymbol.cpp.o
 CMakeFiles/qgis_linefillsymboltest.dir/qgis_linefillsymboltest_automoc.cpp.o
 -o ../../../output/bin/qgis_linefillsymboltest
 -L/opt/local/var/macports/build/_opt_local_var_macports_sources_rsync.macports.org_release_tarballs_ports_gis_qgis/QGIS/work
 /QGIS-2_18_2/build/src/core
 -L/opt/local/var/macports/build/_opt_local_var_macports_sources_rsync.macports.org_release_tarballs_ports_gis_qgis/QGIS/work
 /QGIS-2_18_2/build/src/gui -Wl,-rpath,/opt/local/lib
 /opt/local/libexec/qt4/lib/libQtXml.dylib
 /opt/local/libexec/qt4/lib/libQtCore.dylib
 /opt/local/libexec/qt4/lib/libQtSvg.dylib
 /opt/local/libexec/qt4/lib/libQtTest.dylib /opt/local/lib/libproj.dylib
 /opt/local/lib/libgeos_c.dylib /opt/local/lib/libgdal.dylib
 ../../../output/lib/qgis_core.framework/Versions/2.18/qgis_core -framework
 CoreFoundation -framework IOKit /opt/local/libexec/qt4/lib/libQtXml.dylib
 /opt/local/libexec/qt4/lib/libQtCore.dylib
 /opt/local/libexec/qt4/lib/libQtGui.dylib
 /opt/local/libexec/qt4/lib/libQtNetwork.dylib
 /opt/local/libexec/qt4/lib/libQtSvg.dylib
 /opt/local/libexec/qt4/lib/libQtWebKit.dylib
 /opt/local/libexec/qt4/lib/libQtSql.dylib
 /opt/local/libexec/qt4/lib/libqca.dylib /opt/local/lib/libproj.dylib
 /opt/local/lib/libgeos_c.dylib /opt/local/lib/libgdal.dylib
 /opt/local/lib/libspatialindex.dylib /opt/local/lib/libexpat.dylib
 /opt/local/lib/libsqlite3.dylib /opt/local/lib/libspatialite.dylib
 [ 33%] Built target qgis_maprotationtest
 make[2]: Leaving directory
 `/opt/local/var/macports/build/_opt_local_var_macports_sources_rsync.macports.org_release_tarballs_ports_gis_qgis/QGIS/work
 /QGIS-2_18_2/build'
 [ 33%] Built target qgis_linefillsymboltest
 6 errors generated.
 make[2]: ***
 [python/CMakeFiles/python_module_qgis__core.dir/core/sip_corepart3.cpp.o]
 Error 1
 make[2]: *** Waiting for unfinished jobs....
 [ 33%] Linking CXX executable ../../../output/bin/qgis_svgmarkertest
 cd
 /opt/local/var/macports/build/_opt_local_var_macports_sources_rsync.macports.org_release_tarballs_ports_gis_qgis/QGIS/work
 /QGIS-2_18_2/build/tests/src/core && /opt/local/bin/cmake -E
 cmake_link_script CMakeFiles/qgis_svgmarkertest.dir/link.txt --verbose=ON
 /usr/bin/clang++   -pipe -Os -stdlib=libc++ -DSPATIALITE_VERSION_GE_4_0_0
 -DSPATIALITE_VERSION_G_4_1_1 -DSPATIALITE_HAS_INIT_EX -std=c++11 -Wno-
 error=c++11-narrowing -Wall -Wextra -Wno-long-long -Wformat-security -Wno-
 strict-aliasing -Wno-return-type-c-linkage -Wno-overloaded-virtual
 -Qunused-arguments -DNDEBUG -arch x86_64 -mmacosx-version-min=10.12
 -Wl,-search_paths_first -Wl,-headerpad_max_install_names -L/opt/local/lib
 -Wl,-headerpad_max_install_names -Qunused-arguments -F/Library/Frameworks
 CMakeFiles/qgis_svgmarkertest.dir/testqgssvgmarker.cpp.o
 CMakeFiles/qgis_svgmarkertest.dir/qgis_svgmarkertest_automoc.cpp.o  -o
 ../../../output/bin/qgis_svgmarkertest
 -L/opt/local/var/macports/build/_opt_local_var_macports_sources_rsync.macports.org_release_tarballs_ports_gis_qgis/QGIS/work
 /QGIS-2_18_2/build/src/core
 -L/opt/local/var/macports/build/_opt_local_var_macports_sources_rsync.macports.org_release_tarballs_ports_gis_qgis/QGIS/work
 /QGIS-2_18_2/build/src/gui -Wl,-rpath,/opt/local/lib
 /opt/local/libexec/qt4/lib/libQtXml.dylib
 /opt/local/libexec/qt4/lib/libQtCore.dylib
 /opt/local/libexec/qt4/lib/libQtSvg.dylib
 /opt/local/libexec/qt4/lib/libQtTest.dylib /opt/local/lib/libproj.dylib
 /opt/local/lib/libgeos_c.dylib /opt/local/lib/libgdal.dylib
 ../../../output/lib/qgis_core.framework/Versions/2.18/qgis_core -framework
 CoreFoundation -framework IOKit /opt/local/libexec/qt4/lib/libQtXml.dylib
 /opt/local/libexec/qt4/lib/libQtCore.dylib
 /opt/local/libexec/qt4/lib/libQtGui.dylib
 /opt/local/libexec/qt4/lib/libQtNetwork.dylib
 /opt/local/libexec/qt4/lib/libQtSvg.dylib
 /opt/local/libexec/qt4/lib/libQtWebKit.dylib
 /opt/local/libexec/qt4/lib/libQtSql.dylib
 /opt/local/libexec/qt4/lib/libqca.dylib /opt/local/lib/libproj.dylib
 /opt/local/lib/libgeos_c.dylib /opt/local/lib/libgdal.dylib
 /opt/local/lib/libspatialindex.dylib /opt/local/lib/libexpat.dylib
 /opt/local/lib/libsqlite3.dylib /opt/local/lib/libspatialite.dylib
 make[2]: Leaving directory
 `/opt/local/var/macports/build/_opt_local_var_macports_sources_rsync.macports.org_release_tarballs_ports_gis_qgis/QGIS/work
 /QGIS-2_18_2/build'
 [ 33%] Built target qgis_svgmarkertest
 CRS update (inserted:0 updated:0 deleted:0 errors:0)
 No CRS updates were necessary.
 make[2]: Leaving directory
 `/opt/local/var/macports/build/_opt_local_var_macports_sources_rsync.macports.org_release_tarballs_ports_gis_qgis/QGIS/work
 /QGIS-2_18_2/build'
 [ 33%] Built target synccrsdb
 1 error generated.
 make[2]: ***
 [python/CMakeFiles/python_module_qgis__core.dir/core/sip_corepart1.cpp.o]
 Error 1
 1 error generated.
 make[2]: ***
 [python/CMakeFiles/python_module_qgis__core.dir/core/sip_corepart2.cpp.o]
 Error 1
 make[2]: Leaving directory
 `/opt/local/var/macports/build/_opt_local_var_macports_sources_rsync.macports.org_release_tarballs_ports_gis_qgis/QGIS/work
 /QGIS-2_18_2/build'
 make[1]: *** [python/CMakeFiles/python_module_qgis__core.dir/all] Error 2
 make[1]: Leaving directory
 `/opt/local/var/macports/build/_opt_local_var_macports_sources_rsync.macports.org_release_tarballs_ports_gis_qgis/QGIS/work
 /QGIS-2_18_2/build'
 make: *** [all] Error 2
 make: Leaving directory
 `/opt/local/var/macports/build/_opt_local_var_macports_sources_rsync.macports.org_release_tarballs_ports_gis_qgis/QGIS/work
 /QGIS-2_18_2/build'
 Command failed:  cd
 "/opt/local/var/macports/build/_opt_local_var_macports_sources_rsync.macports.org_release_tarballs_ports_gis_qgis/QGIS/work
 /QGIS-2_18_2/build" && /usr/bin/make -j8 -w all VERBOSE=ON
 Exit code: 2
 Error: Failed to build QGIS: command execution failed
 DEBUG: Error code: CHILDSTATUS 52744 2
 DEBUG: Backtrace: command execution failed
     while executing
 "system {*}$notty {*}$nice $fullcmdstring"
     invoked from within
 "command_exec build"
     (procedure "portbuild::build_main" line 8)
     invoked from within
 "$procedure $targetname"
 Error: See
 /opt/local/var/macports/logs/_opt_local_var_macports_sources_rsync.macports.org_release_tarballs_ports_gis_qgis/QGIS/main.log
 for details.
 Error: Follow https://guide.macports.org/#project.tickets to report a bug.
 Error: Processing of port QGIS failed
 [mac27:/Volumes/User/bmcinnes] root#

--
Ticket URL: <https://trac.macports.org/ticket/53231#comment:34>
MacPorts <https://www.macports.org/>
Ports system for macOS
Reply | Threaded
Open this post in threaded view
|  
Report Content as Inappropriate

Re: [MacPorts] #53231: QGIS @2_18_2_2 build failure

MacPorts
In reply to this post by MacPorts
#53231: QGIS @2_18_2_2 build failure
-----------------------+----------------------
  Reporter:  gcarlino  |      Owner:  Veence
      Type:  defect    |     Status:  assigned
  Priority:  Normal    |  Milestone:
 Component:  ports     |    Version:  2.3.5
Resolution:            |   Keywords:
      Port:  QGIS      |
-----------------------+----------------------

Comment (by aaschwanden):

 On a new Macbook Pro with Sierra and a clean install of MacPorts, I get
 that far:


 {{{
 CMake Error: The following variables are used in this project, but they
 are set to NOTFOUND.
 Please set them or make sure they are set and tested correctly in the
 CMake files:
 QSCINTILLA_LIBRARY
     linked by target "qgis_gui" in directory
 /opt/local/var/macports/build/_opt_local_var_macports_sources_rsync.macports.org_macports_release_tarballs_ports_gis_qgis/QGIS/work
 /QGIS-2_18_3/src/gui

 -- Configuring incomplete, errors occurred!

 }}}


 (Note: same issue with the default 2.18.2_2, I just tried to update to see
 if the error goes away)

 Qscintilla is installed:


 {{{
 port installed qscintilla
 The following ports are currently installed:
   qscintilla @2.10_0 (active)

 }}}

--
Ticket URL: <https://trac.macports.org/ticket/53231#comment:35>
MacPorts <https://www.macports.org/>
Ports system for macOS
Reply | Threaded
Open this post in threaded view
|  
Report Content as Inappropriate

Re: [MacPorts] #53231: QGIS @2_18_2_2 build failure

MacPorts
In reply to this post by MacPorts
#53231: QGIS @2_18_2_2 build failure
-----------------------+----------------------
  Reporter:  gcarlino  |      Owner:  Veence
      Type:  defect    |     Status:  assigned
  Priority:  Normal    |  Milestone:
 Component:  ports     |    Version:  2.3.5
Resolution:            |   Keywords:
      Port:  QGIS      |
-----------------------+----------------------
Changes (by aaschwanden):

 * Attachment "main.log" added.

 main.log for fresh MacPorts on Sierra

--
Ticket URL: <https://trac.macports.org/ticket/53231>
MacPorts <https://www.macports.org/>
Ports system for macOS
Reply | Threaded
Open this post in threaded view
|  
Report Content as Inappropriate

Re: [MacPorts] #53231: QGIS @2_18_2_2 build failure

MacPorts
In reply to this post by MacPorts
#53231: QGIS @2_18_2_2 build failure
-----------------------+----------------------
  Reporter:  gcarlino  |      Owner:  Veence
      Type:  defect    |     Status:  assigned
  Priority:  Normal    |  Milestone:
 Component:  ports     |    Version:  2.3.5
Resolution:            |   Keywords:
      Port:  QGIS      |
-----------------------+----------------------

Comment (by michaelld):

 qscintilla @2.10_0 changed the library install name to match that for
 linux installs. I'm looking into this.

--
Ticket URL: <https://trac.macports.org/ticket/53231#comment:36>
MacPorts <https://www.macports.org/>
Ports system for macOS
Reply | Threaded
Open this post in threaded view
|  
Report Content as Inappropriate

Re: [MacPorts] #53231: QGIS @2_18_2_2 build failure

MacPorts
In reply to this post by MacPorts
#53231: QGIS @2_18_2_2 build failure
-----------------------+----------------------
  Reporter:  gcarlino  |      Owner:  Veence
      Type:  defect    |     Status:  assigned
  Priority:  Normal    |  Milestone:
 Component:  ports     |    Version:  2.3.5
Resolution:            |   Keywords:
      Port:  QGIS      |
-----------------------+----------------------

Comment (by michaelld):

 I'm attaching a patch to fix the Qsci cmake issue. QGIS still doesn't
 build for me, even with all of the patches attached or noted here.

--
Ticket URL: <https://trac.macports.org/ticket/53231#comment:37>
MacPorts <https://www.macports.org/>
Ports system for macOS
Reply | Threaded
Open this post in threaded view
|  
Report Content as Inappropriate

Re: [MacPorts] #53231: QGIS @2_18_2_2 build failure

MacPorts
In reply to this post by MacPorts
#53231: QGIS @2_18_2_2 build failure
-----------------------+----------------------
  Reporter:  gcarlino  |      Owner:  Veence
      Type:  defect    |     Status:  assigned
  Priority:  Normal    |  Milestone:
 Component:  ports     |    Version:  2.3.5
Resolution:            |   Keywords:
      Port:  QGIS      |
-----------------------+----------------------
Changes (by michaelld):

 * Attachment "patch-cmake_FindQScintilla.cmake.diff" added.


--
Ticket URL: <https://trac.macports.org/ticket/53231>
MacPorts <https://www.macports.org/>
Ports system for macOS
Reply | Threaded
Open this post in threaded view
|  
Report Content as Inappropriate

Re: [MacPorts] #53231: QGIS @2_18_2_2 build failure

MacPorts
In reply to this post by MacPorts
#53231: QGIS @2_18_2_2 build failure
-----------------------+----------------------
  Reporter:  gcarlino  |      Owner:  Veence
      Type:  defect    |     Status:  assigned
  Priority:  Normal    |  Milestone:
 Component:  ports     |    Version:  2.3.5
Resolution:            |   Keywords:
      Port:  QGIS      |
-----------------------+----------------------

Comment (by aaschwanden):

 Thanks for the qscintilla patch.

--
Ticket URL: <https://trac.macports.org/ticket/53231#comment:38>
MacPorts <https://www.macports.org/>
Ports system for macOS
Reply | Threaded
Open this post in threaded view
|  
Report Content as Inappropriate

Re: [MacPorts] #53231: QGIS @2_18_2_2: error: virtual function 'dataType' has a different return type ('int') than the function it overrides (which has return type 'QGis::DataType') (was: QGIS @2_18_2_2 build failure)

MacPorts
In reply to this post by MacPorts
#53231: QGIS @2_18_2_2: error: virtual function 'dataType' has a different return
type ('int') than the function it overrides (which has return type
'QGis::DataType')
-----------------------+----------------------
  Reporter:  gcarlino  |      Owner:  Veence
      Type:  defect    |     Status:  assigned
  Priority:  Normal    |  Milestone:
 Component:  ports     |    Version:  2.3.5
Resolution:            |   Keywords:
      Port:  QGIS      |
-----------------------+----------------------
Changes (by ryandesign):

 * cc: julgp (added)


Comment:

 Has duplicate #53373.

--
Ticket URL: <https://trac.macports.org/ticket/53231#comment:39>
MacPorts <https://www.macports.org/>
Ports system for macOS
123
Loading...